{"text_format":"1","workbook":"xlsx","n_sheets":7,"sheets":["Notice technique","1. Présentation","2. Données de caractérisation","3. Données","Data de liste","Nomenclature","Dev"],"not_rendered":{"charts":0,"images":2,"macros":1,"external_links":0,"defined_names":52,"comments":0,"pivot_tables":0},"unopened":[],"bounds":{"document_bytes":16777216,"sheet_cells":100000,"rows_first":2000,"rows_last":500,"rows_between":2000,"halvings":0,"cell_chars":16384,"cell_head_chars":4096},"cells_cut":0,"cells_raw":0,"read":"whole","date_system":"1900"}

{"sheet":"Notice technique","index":0,"n_rows":43,"n_cols":3,"rows_kept":43,"cut":false,"hidden":false,"merged":[[0,2,3,12],[34,1,34,18],[38,1,38,18],[18,2,18,18],[22,2,22,18],[29,2,29,18],[8,1,8,18]]}
[null,null,"           DÉPARTEMENT D’ÉVALUATION DES FORMATIONS"]
["DEF Archi","V 1.00"]
[]
[]
[]
[null,"Note d'utilisation"]
[]
[null,"Pour quelles formations ?"]
[null,"Ce tableau de données fait partie du dossier d'autoévaluation (DAE 02) élaborés par les diplômes nationaux, portés par les écoles du domaine de la culture (art, design, architecture, paysage) en vue de leur évaluation en vague A. Il s'agit en particulier des diplômes conférant le grade de licence ou de master (DNA, DNSEP, DEEA, DEA, diplômes d'établissement, etc.). "]
[]
[null,"Pourquoi ce tableau ?"]
[null,"Ce tableau a pour finalité la collecte des données quantitatives et d'auto-positionnement des formations des écoles du domaine de la culture. "]
[null,"Les comités d'experts s'appuieront sur ces dossiers d'autoévaluation dans le processus d'évaluation des formations de l'établissement."]
[]
[null,"Comment le remplir ?"]
[null,"Le mode d'emploi pratique pour renseigner ce tableau est le suivant."]
[]
[null,"1. Activer le contenu à l'ouverture du fichier"]
[null,null,"À l'ouverture du fichier, il est indispensable d'accepter l'activation des macros (ou des contenus) lorsque le tableur vous y invite, sans quoi le fichier ne pourra pas fonctionner correctement."]
[]
[null,"2. Renseigner d'abord les informations de l'onglet \"Présentation\""]
[null,null,"En premier lieu, choisir l'établissement et la formation concernés."]
[null,null,"Pour les DNA et DNSEP, Indiquer ensuite, le cas échéant, le nombre de mentions du diplôme. Ceci génèrera les lignes de saisie relatives aux données déclinées pour chaque mention dans l'ensemble des onglets, lesquelles sont repérées par un astérisque."]
[null,null,"Il ne faut pas intervenir sur le fichier pendant le processus de génération de lignes. Ce processus peut prendre quelques instants."]
[null,null,"Renseigner alors l'intitulé de chaque mention en face des cellules \"Intitulé des mentions\"."]
[]
[null,"3. Renseigner ensuite les deux autres onglets"]
[null,null,"Vous pouvez les saisir dans l'ordre de votre choix."]
[null,null,"Des définitions de certains termes et de certaines données sont fournies par le Hcéres dans le \"Glossaire de l’évaluation des formations\" accessible sur le lien suivant :   "]
[null,null,"https://www.hceres.fr/sites/default/files/DAE_vague-A/formation/repere_autoevaluation_formation.pdf"]
{"$rows_left_out":14}
{"sheet":"1. Présentation","index":1,"n_rows":904,"n_cols":6,"rows_kept":904,"cut":false,"hidden":false,"merged":[[5,1,5,2],[0,1,3,4]]}
[null,"DÉPARTEMENT D’ÉVALUATION DES FORMATIONS"]
[]
[]
[]
[]
[null,"1. Présentation de la formation"]
[]
["Code de la donnée"]
["P1","CI1","Établissement",null,null,"Sélectionnez un établissement dans la liste déroulante."]
["P2","CI2","Code UAI",{"$f":"IF(ISERROR(VLOOKUP($D$9,Nomenclature!$A$2:$B$8,2,FALSE)),\"\",VLOOKUP($D$9,Nomenclature!$A$2:$B$8,2,FALSE))","v":""}]
["P3","CI4","Intitulé du diplôme",null,null,"Sélectionner un intitulé de formation dans la liste déroulante. \nCet intitulé correspond à la liste transmise par l'établissement au Hcéres en septembre 2024."]
["P4",null,"Niveau de cursus",{"$f":"IF(ISERROR(INDEX(Nomenclature!$O$2:$O$24,MATCH(1,(Nomenclature!$L$2:$L$24=$D$9)*(Nomenclature!$M$2:$M$24=$D$11),0))),\"\",(INDEX(Nomenclature!$O$2:$O$24,MATCH(1,(Nomenclature!$L$2:$L$24=$D$9)*(Nomenclature!$M$2:$M$24=$D$11),0))))","v":""}]
["P5","s","Lieu(x) de formation (y compris formations délocalisées)",null,null,"Indiquer la ou les villes où est dispensée la formation."]
["P6",null,"Numéro d'identification",{"$f":"IF(ISERROR(INDEX(Nomenclature!$P$2:$P$24,MATCH(1,(Nomenclature!$L$2:$L$24=$D$9)*(Nomenclature!$M$2:$M$24=$D$11),0))),\"\",(INDEX(Nomenclature!$P$2:$P$24,MATCH(1,(Nomenclature!$L$2:$L$24=$D$9)*(Nomenclature!$M$2:$M$24=$D$11),0))))","v":""}]
["P7","CI6","Responsable(s) de la formation",null,null,"Indiquer le nom du ou des responsable(s) du diplôme.\n(500 caractères maximum)                      "]
["P8","CI8","Nombre de mentions de la formation",null,null,"Pour les DNA et DNESP, indiquer le nombre de mentions. Si le nombre est supérieur ou égal à 2, il correspondra aux lignes qui seront ajoutées automatiquement dans les données déclinées par mention (marquées d'un astérisque). Cette opération peut prendre quelques instants voire plus, notamment lorsque le nombre de mentions est important. Si vous modifiez le nombre de mentions en augmentant la valeur déjà saisie, des lignes supplémentaires seront ajoutées dans l’ensemble des onglets. \nEn revanche, il n’est pas possible de modifier le nombre de mentions à la baisse pour éviter toute perte d’informations dans le DAE ; il vous faudra dans ce cas recommencer la saisie.\nPour les formations ayant un tronc commun à plusieurs mentions au sein d'un même diplôme (ex. 1re année commune), compter le tronc commun comme une \"mention\" dans le calcul du nombre de mentions.\n"]
["P9",null,"Intitulé des mentions",null,null,"Indiquer l'intitulé des mentions en vigueur en 2023-2024. Si cet intitulé a été modifié durant la période de l'évaluation, le préciser dans le dossier d'autoévaluation de la formation.\n(500 caractères maximum)"]
[]
[]
[]
[null,null,"étab","formation_nom"]
[null,null,"La_Rochelle_U","Droit"]
[null,null,"La_Rochelle_U","Génie civil"]
[null,null,"La_Rochelle_U","Géographie et aménagement"]
[null,null,"La_Rochelle_U","Gestion"]
[null,null,"La_Rochelle_U","Histoire"]
[null,null,"La_Rochelle_U","Informatique"]
[null,null,"La_Rochelle_U","Langues étrangères appliquées"]
[null,null,"La_Rochelle_U","Lettres"]
[null,null,"La_Rochelle_U","Mathématiques"]
{"$rows_left_out":875}
{"sheet":"2. Données de caractérisation","index":2,"n_rows":32,"n_cols":9,"rows_kept":32,"cut":false,"hidden":false,"merged":[[9,1,9,2],[2,6,4,6],[0,1,3,5],[7,1,7,2],[5,1,5,5]]}
[null,"DÉPARTEMENT D’ÉVALUATION DES FORMATIONS"]
[]
[]
[]
[]
[null,{"$f":"IF('1. Présentation'!D11<>\"\",'1. Présentation'!D11,\"\")","v":""}]
[]
[null,"2- Données de caractérisation de la formation"]
[]
[null,"Données de caractérisation",null,"Année \n2021-2022","Année \n2022-2023","Année \n2023-2024","Précisions sur la définition et/ou le mode de calcul de la donnée \n(en particulier, lorsque les éléments présents dans le système d'information (SI) de l'établissement ne correspondent pas aux éléments indiqués par le Hcéres)\n(500 caractères maximum)"]
["IG1","DC 1","Nombre total d’inscrits administratifs dans la formation (dans toute la formation)*",null,null,null,null,null,"IG1"]
[null,"DC 2","dont étudiants internationaux*"]
[null,"DC 3","dont étudiants ayant des besoins spécifiques et bénéficiant d'un aménagement d'études*"]
["IG1","DC 4","Nombre total d’hommes inscrits dans la formation (inscrits administratifs dans toute la formation)",null,null,null,null,null,"IG1"]
["IG1","DC 5","Nombre total de femmes inscrites dans la formation (inscrits administratifs dans toute la formation)",null,null,null,null,null,"IG1"]
[null,"DC 6a","Nombre total d’inscrits administratifs en 1re année de la formation*"]
[null,"DC 6b","Nombre total d’inscrits administratifs en 2e année de la formation*"]
[null,"DC 6c","Nombre total d’inscrits administratifs en 3e année de la formation*"]
[null,"DC 6d","Nombre total d’inscrits administratifs en 4e année de la formation* (pour les formations en 5 ans)"]
[null,"DC 6e","Nombre total d’inscrits administratifs en 5e année de la formation* (pour les formations en 5 ans)"]
[null,"DC 7a","Nombre de diplômés de l'année*"]
[null,"DC 7b","Nombre de diplômés de l'année ayant obtenu le diplôme sans allongement de la durée de la formation (en 3 ans dans le 1er cycle, en 2 ans dans le 2e cycle)*"]
[null,"DC 7c","Nombre de diplômés de l'année ayant obtenu le diplôme avec allongement de la durée de la formation (en plus de 3 ans dans le 1er cycle, en plus de 2 ans dans le 2e cycle)*"]
[null,"DC 8","Capacité d'accueil des néo-entrants dans la 1re année  du cycle (affichée, le cas échéant, dans Parcoursup pour le 1er cycle)"]
[null,"DC 9","Nombre total d'heures étudiant du programme de la formation effectivement mis en œuvre (moyenne des mentions, le cas échéant)"]
[null,"DC 9a","Nombre d'heures étudiant du programme de la 1re année de la formation"]
[null,"DC 9b","Nombre d'heures étudiant du programme de la 2e année de la formation"]
[null,"DC 9c","Nombre d'heures étudiant du programme de la 3e année de la formation"]
[null,"DC 9d","Nombre d'heures étudiant du programme de la 4e année de la formation (pour les diplômes en 5 ans)"]
[null,"DC 9e","Nombre d'heures étudiant du programme de la 5e année de la formation (pour les diplômes en 5 ans)"]
{"$rows_left_out":3}
{"sheet":"3. Données","index":3,"n_rows":70,"n_cols":10,"rows_kept":70,"cut":false,"hidden":false,"merged":[[8,9,9,9],[14,3,15,3],[23,3,24,3],[54,3,62,3],[36,3,39,3],[41,3,46,3],[48,3,52,3],[8,3,9,3],[18,3,20,3],[25,3,28,3],[31,3,32,3],[63,1,65,1],[3,5,4,8],[48,2,52,2],[54,2,62,2],[10,1,28,1],[8,6,8,8],[8,2,9,2],[8,5,9,5],[8,4,9,4],[41,2,46,2],[14,2,15,2],[23,2,24,2],[25,2,28,2],[40,1,62,1],[18,2,20,2],[36,2,39,2],[3,1,3,2],[5,1,5,2],[6,1,6,2],[3,3,6,3],[29,1,39,1]]}
[null,"DÉPARTEMENT D’ÉVALUATION DES FORMATIONS"]
[]
[]
[null,{"$f":"IF('1. Présentation'!D11<>\"\",'1. Présentation'!D11,\"\")","v":""},null,"*Pour une définition des niveaux de la grille d'auto-positionnement, voir le tableau à droite"]
[]
[]
[null,"Cet onglet permet de présenter l'auto-positionnement (colonne D) et les données quantitatives (colonnes E à I), qui étayent l'analyse de chaque critère ou référence du référentiel d'évaluation d'une formation du 1er et du 2e cycle des écoles du domaine de la culture, menée par l'équipe pédagogique dans le cadre de son autoévaluation. Pour chaque donnée quantitative, indiquer une valeur caractérisant la formation pour chacune des années de référence (colonnes E à I).\nLorsque la donnée est invariante dans la période de référence, indiquer la valeur correspondant à 2023-2024 (colonne I), les autres cases étant grisées. "]
[]
[null,null,"Référentiel d'évaluation des formations du 1er et du 2e cycle des écoles du domaine de la culture","Auto-positionnement\n\nNiveau atteint : \n1, 2, 3, 4, 5 *","Code de la donnée","Données quantitatives","Valeurs pour chaque année de la période de référence",null,null,"Précisions sur la définition et/ou le mode de calcul de la donnée \n(en particulier, lorsque les éléments présents dans le SI de l'établissement ne correspondent pas aux éléments indiqués par le Hcéres)\n(500 caractères maximum)"]
[null,null,null,null,null,null,"Année 2021-2022","Année 2022-2023","Année 2023-2024"]
[null,"Domaine 1 :\n La politique et la caractérisation de la formation","Référence 1 : La formation est en adéquation avec la stratégie de formation de l’établissement."]
[null,null,"C1. La formation est construite en cohérence et en complémentarité avec les autres formations du même cycle et en articulation avec celles des autres cycles avec lesquelles elle s’inscrit en continuum, au sein de l'établissement et/ou du site."]
[null,null,"C2. La formation intègre les enjeux de la transition écologique."]
[null,null,"Référence 2 : La formation est ouverte à l’international en cohérence avec les priorités définies par l’établissement."]
[null,null,"C1. La formation inclut des mobilités entrantes et sortantes des étudiants, et bénéficie, à cet effet, d'un soutien y compris financier.",null,"DQT 2-1a","Nombre d'étudiants ayant bénéficié d'une mobilité internationale sortante (séjour d'études, stage, etc.)"]
[null,null,null,null,"DQT 2-1b","Nombre d'étudiants ayant bénéficié d'une mobilité internationale entrante encadrée"]
[null,null,"Référence 3 : La formation bénéficie d’un adossement à la recherche."]
[null,null,"C1. La formation intègre une formation à et par la recherche adaptée à sa finalité. ",null,"DQT 3-1","Nombre d'heures étudiant, dans la maquette de la formation (moyenne des mentions le cas échéant) d'initiation à la recherche (séminaires de recherche, méthodologie de la recherche)"]
[null,null,"C2. Des enseignants-chercheurs des disciplines de la formation participent aux enseignements.",null,"DQT 3-2a","Nombre d'enseignants-chercheurs de la ou des disciplines pertinentes intervenant dans la formation"]
[null,null,null,null,"DQT 3-2b","Nombre de docteurs de la ou des disciplines pertinentes intervenant dans la formation "]
[null,null,null,null,"DQT 3-2c","Nombre d'heures étudiant, dans la maquette de la formation (moyenne des mentions le cas échéant), assurées par des enseignants-chercheurs"]
[null,null,"Référence 4 : La formation entretient des relations avec le monde culturel, social et économique et intègre des éléments de professionnalisation."]
[null,null,"C1. La formation prend en compte les besoins culturels, sociaux et économiques du territoire pour définir ses débouchés, sa finalité et ses contenus, en lien avec sa fiche RNCP**. Elle associe les acteurs culturels, sociaux et économiques à cette démarche et valorise auprès d'eux les compétences auxquelles elle forme."]
[null,null,"C2. La formation associe les acteurs culturels, sociaux et économiques à ses activités pédagogiques.",null,"DQT 4-2a","Nombre de professionnels extérieurs (professeurs associés, maîtres de conférences associés, vacataires) intervenant dans la formation"]
[null,null,null,null,"DQT 4-2b","Nombre d'heures étudiant dans le prorgramme de la formation (moyenne des mentions, le cas échéant, hors suivi de stages et de projets) assurées par des professionnels du ou des secteurs d'activité de la formation"]
[null,null,"C2. La formation prépare à l’insertion professionnelle et à l’entrepreneuriat au cours du cursus. ",null,"DQT 4-3a","Nombre de semaines de stage obligatoire dans le programme de la formation (moyenne des mentions, le cas échéant)"]
[null,null,null,null,"DQT 4-3b","Nombre d'ECTS accordés au(x) stage(s) dans le programme de la formation (moyenne des mentions, le cas échéant)"]
[null,null,null,null,"DQT 4-3c","Nombre d'ECTS accordés au(x) projet(s) dans le programme de la formation (moyenne des mentions, le cas échéant)"]
[null,null,null,null,"DQT 4-3d","Nombre d'ECTS de formation à l'entrepreneuriat"]
[null,"Domaine 2 :\n L’organisation pédagogique de la formation","Référence 5 : La formation met en œuvre les contenus et les méthodes pédagogiques adaptés aux compétences visées."]
{"$rows_left_out":41}
{"sheet":"Data de liste","index":4,"n_rows":6,"n_cols":1,"rows_kept":6,"cut":false,"hidden":true,"merged":[]}
["Choix d'auto-positionnement"]
[1]
[2]
[3]
[4]
[5]

{"sheet":"Nomenclature","index":5,"n_rows":24,"n_cols":18,"rows_kept":24,"cut":false,"hidden":true,"merged":[]}
["Établissements","Codes UAI",null,"École supérieure d'art et design Grenoble - Valence","École supérieure d'art de Clermont metropole","École supérieure d'art Annecy Alpes","École nationale supérieure des beaux arts de Lyon","École nationale supérieure d'architecture de Toulouse","École nationale supérieure d'architecture de Lyon","Conservatoire national superieur musique et danse de Lyon",null,"LibellŽ Žtablissement","IntitulŽ indiquŽ dans l'arrtŽ d'accrŽditation\"","Code UAI Etablissement","Type de formation indiquŽ dans l'arrtŽ d'accrŽditation\"","NumŽro d'accrŽditation de la mention","Domaine indiquŽ dans l'arrtŽ d'accrŽditation\"","Composante de rattachement"]
["Conservatoire national superieur musique et danse de Lyon","0693133F",5,"Diplôme national d'art - option Art","Diplôme national d'art - option Art","Diplôme national d'art - option Art","Diplôme national d'art - option Art","Diplôme d'État d'architecte (DEA)","Diplôme d'État d'architecte (DEA)","Diplôme de 2e cycle supérieur de Métiers de la création musicale",null,"École supérieure d'art et design Grenoble - Valence","Diplôme national d'art - option Art","0380144A","DNA","NOACCRED_640","Culture"]
["École nationale supérieure d'architecture de Lyon","0690184A",2,"Diplôme national d'art - option Design","Diplôme national supérieur d'expression plastique - option Art","Diplôme national d'art - option Design","Diplôme national d'art - option Design","Diplôme d'études en architecture (DEEA)\r\n","Diplôme d'études en architecture (DEEA)\r\n","Diplôme de 2e cycle supérieur de Métiers de la culture musicale",null,"École supérieure d'art et design Grenoble - Valence","Diplôme national d'art - option Design","0380144A","DNA","NOACCRED_647","Culture"]
["École nationale supérieure d'architecture de Toulouse","0310150V",2,"Diplôme national supérieur d'expression plastique - option Art",null,"Diplôme national supérieur d'expression plastique - option Art","Diplôme national supérieur d'expression plastique - option Art",null,null,"Diplôme de 2e cycle supérieur de Musicien-interprète",null,"École supérieure d'art et design Grenoble - Valence","Diplôme national supérieur d'expression plastique - option Art","0380144A","DNSEP","NOACCRED_653","Culture"]
["École nationale supérieure des beaux arts de Lyon","0690185B",4,"Diplôme national supérieur d'expression plastique - option Design",null,"Diplôme national supérieur d'expression plastique - option Design","Diplôme national supérieur d'expression plastique - option Design",null,null,"Diplôme de 2e cycle supérieur de Musicien-performeur",null,"École supérieure d'art et design Grenoble - Valence","Diplôme national supérieur d'expression plastique - option Design","0380144A","DNSEP","NOACCRED_660","Culture"]
["École supérieure d'art Annecy Alpes","0741444T",4,null,null,null,null,null,null,"Diplôme de 2e cycle supérieur de Pédagogie, enseignement musique",null,"École supérieure d'art de Clermont metropole","Diplôme national d'art - option Art","0630105X","DNA","NOACCRED_638","Culture"]
["École supérieure d'art de Clermont metropole","0630105X",2,null,null,null,null,null,null,null,null,"École supérieure d'art de Clermont metropole","Diplôme national supérieur d'expression plastique - option Art","0630105X","DNSEP","NOACCRED_651","Culture"]
["École supérieure d'art et design Grenoble - Valence","0380144A",4,null,null,null,null,null,null,null,null,"École supérieure d'art Annecy Alpes","Diplôme national d'art - option Art","0741444T","DNA","NOACCRED_637","Culture"]
[null,null,23,null,null,null,null,null,null,null,null,"École supérieure d'art Annecy Alpes","Diplôme national d'art - option Design","0741444T","DNA","NOACCRED_645","Culture"]
[null,null,null,null,null,null,null,null,null,null,null,"École supérieure d'art Annecy Alpes","Diplôme national supérieur d'expression plastique - option Art","0741444T","DNSEP","NOACCRED_650","Culture"]
[null,null,null,null,null,null,null,null,null,null,null,"École supérieure d'art Annecy Alpes","Diplôme national supérieur d'expression plastique - option Design","0741444T","DNSEP","NOACCRED_658","Culture"]
[null,null,null,null,null,null,null,null,null,null,null,"École nationale supérieure des beaux arts de Lyon","Diplôme national d'art - option Art","0690185B","DNA","NOACCRED_636","Culture"]
[null,null,null,null,null,null,null,null,null,null,null,"École nationale supérieure des beaux arts de Lyon","Diplôme national d'art - option Design","0690185B","DNA","NOACCRED_644","Culture"]
[null,null,null,null,null,null,null,null,null,null,null,"École nationale supérieure des beaux arts de Lyon","Diplôme national supérieur d'expression plastique - option Art","0690185B","DNSEP","NOACCRED_649","Culture"]
[null,null,null,null,null,null,null,null,null,null,null,"École nationale supérieure des beaux arts de Lyon","Diplôme national supérieur d'expression plastique - option Design","0690185B","DNSEP","NOACCRED_657","Culture"]
[null,null,null,null,null,null,null,null,null,null,null,"École nationale supérieure d'architecture de Toulouse","Diplôme d'État d'architecte (DEA)","0310150V","DEA","NOACCRED_616","Culture"]
[null,null,null,null,null,null,null,null,null,null,null,"École nationale supérieure d'architecture de Toulouse","Diplôme d'études en architecture (DEEA)\r\n","0310150V","DEEA","NOACCRED_620","Culture"]
[null,null,null,null,null,null,null,null,null,null,null,"École nationale supérieure d'architecture de Lyon","Diplôme d'État d'architecte (DEA)","0690184A","DEA","NOACCRED_614","Culture"]
[null,null,null,null,null,null,null,null,null,null,null,"École nationale supérieure d'architecture de Lyon","Diplôme d'études en architecture (DEEA)\r\n","0690184A","DEEA","NOACCRED_618","Culture"]
[null,null,null,null,null,null,null,null,null,null,null,"Conservatoire national superieur musique et danse de Lyon","Diplôme de 2e cycle supérieur de Métiers de la création musicale","0693133F","Diplôme de 2e cycle supérieur","NOACCRED_622","Culture"]
[null,null,null,null,null,null,null,null,null,null,null,"Conservatoire national superieur musique et danse de Lyon","Diplôme de 2e cycle supérieur de Métiers de la culture musicale","0693133F","Diplôme de 2e cycle supérieur","NOACCRED_623","Culture"]
[null,null,null,null,null,null,null,null,null,null,null,"Conservatoire national superieur musique et danse de Lyon","Diplôme de 2e cycle supérieur de Musicien-interprète","0693133F","Diplôme de 2e cycle supérieur","NOACCRED_624","Culture"]
[null,null,null,null,null,null,null,null,null,null,null,"Conservatoire national superieur musique et danse de Lyon","Diplôme de 2e cycle supérieur de Musicien-performeur","0693133F","Diplôme de 2e cycle supérieur","NOACCRED_625","Culture"]
[null,null,null,null,null,null,null,null,null,null,null,"Conservatoire national superieur musique et danse de Lyon","Diplôme de 2e cycle supérieur de Pédagogie, enseignement musique","0693133F","Diplôme de 2e cycle supérieur","NOACCRED_626","Culture"]

{"sheet":"Dev","index":6,"n_rows":0,"n_cols":0,"rows_kept":0,"cut":false,"hidden":true,"merged":[]}