{"text_format":"1","workbook":"xlsx","n_sheets":6,"sheets":["Notice technique","1. Présentation","2. Données de caractérisation","3. Données et analyse","Nomenclature","Data des listes"],"not_rendered":{"charts":0,"images":2,"macros":1,"external_links":0,"defined_names":23,"comments":0,"pivot_tables":0},"unopened":[],"bounds":{"document_bytes":16777216,"sheet_cells":100000,"rows_first":2000,"rows_last":500,"rows_between":2000,"halvings":0,"cell_chars":16384,"cell_head_chars":4096},"cells_cut":0,"cells_raw":0,"read":"whole","date_system":"1900"}

{"sheet":"Notice technique","index":0,"n_rows":48,"n_cols":5,"rows_kept":48,"cut":false,"hidden":false,"merged":[[43,1,43,18],[22,2,22,18],[23,2,23,18],[24,2,24,18],[25,2,25,18],[38,1,38,18],[42,1,42,18],[30,4,30,17],[19,2,19,18],[0,2,3,12],[8,1,8,18],[11,1,11,18],[12,1,12,18],[16,1,16,18]]}
[null,null,"DÉPARTEMENT D’ÉVALUATION DES FORMATIONS"]
["DEF 1er cycle","V 1.01"]
[]
[]
[]
[null,"Note d'utilisation"]
[]
[null,"Pour quelles formations ?"]
[null,"Cette trame du dossier d'autoévaluation (DAE 11) est à compléter pour toutes les formations du premier cycle évaluées par le Hcéres en vague A."]
[]
[null,"Pourquoi cette trame du dossier d'autoévaluation ?"]
[null,"Cette trame a pour finalité de collecter, dans un même fichier, toutes les analyses, étayées par des données et un auto-positionnement, constitutives du dossier d'autoévaluation d'une formation du 1er cycle en vue de son évaluation par le Hcéres en vague A."]
[null,"Les données attendues, pour appuyer l'analyse et l'auto-positionnement de chaque critère ou de chaque référence du référentiel d'évaluation des formations du 1er et du 2e cycle, sont de nature qualitative (données textuelles) ou quantitative (données chiffrées). Les données qualitatives sont à renseigner sous la forme d'un texte court ; les données quantitatives sont à renseigner sous forme brute (sauf indication contraire).                                                                                                                                                                                                                                                                                        "]
[]
[]
{"$rows_left_out":34}
{"sheet":"1. Présentation","index":1,"n_rows":19,"n_cols":6,"rows_kept":19,"cut":false,"hidden":false,"merged":[[0,1,3,4],[5,1,5,2]]}
[null,"DÉPARTEMENT D’ÉVALUATION DES FORMATIONS"]
[]
[]
[]
[]
[null,"1. Présentation de la formation"]
[]
["Code de la donnée"]
["P1",null,"Établissement",null,null,"Sélectionner un établissement dans la liste déroulante."]
["P2",null,"Code UAI",{"$f":"IF(ISERROR(VLOOKUP($D$9,Nomenclature!$A$2:$B$20,2,FALSE)),\"\",VLOOKUP($D$9,Nomenclature!$A$2:$B$20,2,FALSE))","v":""}]
["P3",null,"Intitulé de la formation",null,null,"Sélectionner un intitulé de formation dans la liste déroulante. \nCet intitulé correspond à la liste transmise par l'établissement au Hcéres en septembre 2024."]
["P4",null,"Type de cursus",{"$f":"IF(ISERROR(INDEX(Nomenclature!$AA$2:$AA$726,MATCH(1,(Nomenclature!$X$2:$X$726=$D$9)*(Nomenclature!$Y$2:$Y$726=$D$11),0))),\"\",(INDEX(Nomenclature!$AA$2:$AA$726,MATCH(1,(Nomenclature!$X$2:$X$726=$D$9)*(Nomenclature!$Y$2:$Y$726=$D$11),0))))","v":""}]
["P5",null,"Composante de rattachement",null,null,"Saisir le nom de la ou des composante(s) de rattachement (UFR, école, institut) si elle(s) existe(nt). Ne pas inclure le nom des structures internes aux composantes (ex. département). Ne pas saisir d'autres types d'information (ex. données sur l'équipe pédagogique)."]
["P6",null,"Lieu(x) de formation (y compris des parcours diplômants délocalisés)",null,null,"Indiquer la ou les villes où est dispensée la formation."]
["P7",null,"Numéro d'accréditation",{"$f":"IF(ISERROR(INDEX(Nomenclature!$AB$2:$AB$726,MATCH(1,(Nomenclature!$X$2:$X$726=$D$9)*(Nomenclature!$Y$2:$Y$726=$D$11),0))),\"\",(INDEX(Nomenclature!$AB$2:$AB$726,MATCH(1,(Nomenclature!$X$2:$X$726=$D$9)*(Nomenclature!$Y$2:$Y$726=$D$11),0))))","v":""}]
{"$rows_left_out":5}
{"sheet":"2. Données de caractérisation","index":2,"n_rows":29,"n_cols":7,"rows_kept":29,"cut":false,"hidden":false,"merged":[[0,1,3,5],[5,1,5,5],[7,1,7,2],[9,1,9,2]]}
[null,"DÉPARTEMENT D’ÉVALUATION DES FORMATIONS"]
[]
[]
[]
[]
[null,{"$f":"IF('1. Présentation'!D11<>\"\",'1. Présentation'!D11,\"\")","v":""}]
[]
[null,"2. Données de caractérisation de la formation"]
[]
[null,"Données de caractérisation",null,"Année \n2021-2022","Année \n2022-2023","Année \n2023-2024","Précisions sur la définition et/ou le mode de calcul de la donnée \n(en particulier, lorsque les éléments présents dans le système d'information (SI) de l'établissement ne correspondent pas aux éléments indiqués par le Hcéres)\n(500 caractères maximum)"]
[null,"DC 1","Nombre total d’inscrits administratifs dans la formation (dans tout le cycle)*"]
[null,"DC 2","dont étudiants internationaux*"]
[null,"DC 3","dont étudiants ayant des besoins spécifiques et bénéficiant d'un aménagement d'études"]
[null,"DC 4","Nombre total d’hommes inscrits dans la formation (inscrits administratifs dans tout le cycle)"]
[null,"DC 5","Nombre total de femmes inscrites dans la formation (inscrits administratifs dans tout le cycle)"]
{"$rows_left_out":15}
{"sheet":"3. Données et analyse","index":3,"n_rows":137,"n_cols":13,"rows_kept":137,"cut":false,"hidden":false,"merged":[[119,1,132,1],[120,2,121,2],[120,10,121,10],[120,11,121,11],[124,2,127,2],[124,10,127,10],[124,11,127,11],[131,2,132,2],[131,10,132,10],[131,11,132,11],[71,2,72,2],[71,10,72,10],[71,11,72,11],[73,1,118,1],[75,2,87,2],[75,10,87,10],[75,11,87,11],[89,2,105,2],[89,10,105,10],[89,11,105,11],[107,2,118,2],[107,10,118,10],[107,11,118,11],[41,2,44,2],[41,10,44,10],[41,11,44,11],[45,1,72,1],[46,2,47,2],[46,10,47,10],[46,11,47,11],[48,2,50,2],[48,10,50,10],[48,11,50,11],[56,2,62,2],[56,10,62,10],[56,11,62,11],[65,2,70,2],[65,10,70,10],[65,11,70,11],[35,2,36,2],[35,10,36,10],[35,11,36,11],[37,2,39,2],[37,10,39,10],[37,11,39,11],[26,2,27,2],[26,10,27,10],[26,11,27,11],[28,2,30,2],[28,10,30,10],[28,11,30,11],[10,10,11,10],[10,11,11,11],[10,12,11,12],[12,1,44,1],[20,2,22,2],[20,10,22,10],[20,11,22,11],[23,2,24,2],[23,10,24,10],[23,11,24,11],[10,2,11,2],[10,3,11,3],[10,4,11,4],[10,5,11,5],[10,6,11,6],[10,7,10,9],[5,11,8,11],[7,1,7,2],[8,1,8,4],[0,1,3,2],[1,3,4,9],[5,1,5,2],[5,3,7,9],[5,10,8,10]]}
[null,"année +1"]
[]
[]
[]
[]
[null,{"$f":"IF('1. Présentation'!D11<>\"\",'1. Présentation'!D11,\"\")","v":""},null,null,null,null,null,null,null,null,"*Pour une définition des niveaux de la grille d'auto-positionnement, voir le tableau à droite"," *Prise en compte des recommandations du Hcéres ; explication des résultats, des difficultés, des freins et des leviers ; explication des évolutions passées ou à venir ;  mesures correctives proposées"]
[]
[null,"3. Données et analyse"]
[null,"Cet onglet permet de présenter l’autoévaluation de la formation, en s’appuyant sur une analyse (colonne L) et un auto-positionnement (colonne K) menés par l’équipe pédagogique pour chaque critère ou référence du référentiel d'évaluation des formations du 1er et du 2e cycle. Celles-ci sont étayées par des données qualitatives (colonnes E et F) et des données quantitatives (colonnes G à J). \nPour autoévaluer chaque critère ou référence, renseigner, dans les colonnes prévues, les données qualitatives, les analyses et l'auto-positionnement, ainsi que, pour chaque année de référence, les données quantitatives qui s'y rapportent. Lorsque la donnée quantitative est invariante dans la période de référence, indiquer la valeur correspondant à l'année 2023-2024 (colonne J), les autres cases étant grisées."]
[]
[null,null,"Référentiel d'évaluation des formations du 1er et du 2e cycle ","Code de la donnée ","Repères pour les données qualitatives","Données qualitatives \n(1 000 caractères maximum)","Données quantitatives","Valeur pour chaque année de la période de référence",null,null,"Auto-positionnement\n\nNiveau atteint : \n1, 2, 3, 4, 5 *","Analyse obligatoire\n de l'auto-positionnement\n et des données qualitatives \net quantitatives *\n\n(1 500 caractères maximum)","Précisions sur la définition et/ou le mode de calcul de la donnée \n(en particulier, lorsque les éléments présents dans le SI de l'établissement  ou de tous les établissements co-accrédités ne correspondent pas aux éléments indiqués par le Hcéres)\n(500 caractères maximum)"]
[null,null,null,null,null,null,null,"Année 2021-2022","Année 2022-2023","Année 2023-2024"]
[null,"Domaine 1 :\n La politique et la caractérisation de la formation","Référence 1 : La formation est en adéquation avec la stratégie formation de l’établissement."]
[null,null,"C1. La formation définit ses objectifs et ses débouchés, en cohérence avec les ambitions, les orientations pédagogiques et les priorités thématiques de l’établissement.","Document 1","Critère évalué sur la base du document n°1 ayant valeur de preuve "]
[null,null,"C2. La formation est construite en cohérence et en complémentarité avec les autres formations du même cycle et en articulation avec celles des autres cycles avec lesquelles elle s’inscrit en continuum, au sein de l'établissement et/ou du site.","Document 1","Critère évalué sur la base du document n°1 ayant valeur de preuve "]
{"$rows_left_out":123}
{"sheet":"Nomenclature","index":4,"n_rows":787,"n_cols":30,"rows_kept":787,"cut":false,"hidden":true,"merged":[]}
["Établissements","Codes UAI",null,"Université Toulouse Capitole","Université Toulouse 3 - Paul Sabatier","Université Toulouse 2 - Jean Jaurès","Université Savoie Mont Blanc","Université Lumière Lyon-II","Université Jean Moulin Lyon-III","Université Jean Monnet Saint-Étienne","Université Grenoble Alpes","Université de technologie de Tarbes","Université de Perpignan Via-Domitia","Université de Montpellier Paul-Valéry","Université de Montpellier","Université Clermont Auvergne","Université Claude Bernard Lyon-I","Nîmes Université","Institut national universitaire Jean-François Champollion","Institut national d'enseignement supérieur pour l'agriculture, l'alimentation et l'environnement","École normale supérieure de Lyon","École nationale de l'aviation civile",null,"Libellé établissement","Intitulé indiqué dans l'arr\u0090té d'accréditation","Code UAI Etablissement","Type de formation indiqué dans l'arr\u0090té d'accréditation","Numéro d'accréditation de la mention","Domaine indiqué dans l'arr\u0090eté d'accréditation","Composante de rattachement"]
["École nationale de l'aviation civile","0311256X",2,"Administration économique et sociale","Agronomie","Arts","Administration économique et sociale","Activités juridiques : assistant juridique","Assurance, banque, finance : chargé de clientèle","Activités juridiques : assistant juridique","Agronomie","Génie civil - construction durable","Activités juridiques : métiers du droit de l'immobilier","Administration économique et sociale","Acoustique et vibrations","Administration économique et sociale","Aménagement paysager : conception, gestion, entretien","Administration économique et sociale","Droit","Agronomie","Diplôme du cycle pluridisciplinaire d'études supérieures de l'École normale supérieure de Lyon","Élève pilote de ligne",null,"Université Toulouse Capitole","Administration économique et sociale","0313124C","Licence",20140974,"Droit, économie, gestion","Faculté d'administration et communication"]
["École normale supérieure de Lyon","0694123G",1,"Administration publique","Analyse, qualité et contrôle des matériaux produits","Arts du spectacle","Agronomie","Activités juridiques : contentieux et recouvrement","Carrières juridiques ","Administration économique et sociale","Aménagement paysager : conception, gestion, entretien","Génie électrique et informatique industrielle","Activités juridiques : métiers du droit privé","Arts plastiques","Action, commercialisation des services sportifs","Agriculture biologique : production, conseil, certification et commercialisation","Animation et gestion des activités physiques, sportives ou culturelles","Agent de recherches privées","Électronique, énergie électrique, automatique","Gestion et accompagnement de projets pédagogiques",null,"Gestion de la sécurité et exploitation aéronautique",null,"Université Toulouse Capitole","Administration publique","0313124C","Licence",20140973,"Droit, économie, gestion","Institut d'études politiques de Toulouse"]
["Institut national d'enseignement supérieur pour l'agriculture, l'alimentation et l'environnement","0756246G",3,"Aménagement paysager : conception, gestion, entretien","Biologie analytique et expérimentale","Arts plastiques","Animation et gestion des activités physiques, sportives ou culturelles","Activités juridiques : métiers du droit social","Commerce et distribution","Administration publique","Animation et gestion des activités physiques, sportives ou culturelles","Génie mécanique et productique","Administration économique et sociale","Cinéma et audiovisuel","Activités juridiques : assistant juridique","Aménagement paysager : conception, gestion, entretien","Bio-industries et biotechnologies","Arts","Génie des procédés pour l'environnement","Métiers de la protection et de la gestion de l'environnement",null,null,null,"Université Toulouse Capitole","Droit","0313124C","Licence",20140975,"Droit, économie, gestion","Faculté de droit et science politique"]
["Institut national universitaire Jean-François Champollion","0811293R",26,"Carrières juridiques","Cartographie, topographie et systèmes d'information géographique","Carrières sociales - IUT de Blagnac","Carrières sociales ","Administration économique et sociale","Commercialisation de produits et services","Arts du spectacle","Arts du spectacle","Gestion des entreprises et des administrations","Assurance, banque, finance : chargé de clientèle","Diplôme d'études en architecture (DEEA)\r\n","Administration économique et sociale","Animation et gestion des activités physiques, sportives ou culturelles","Certificat de capacité d’orthoptiste","Assurance, banque, finance : chargé de clientèle","Géographie et aménagement",null,null,null,null,"Université Toulouse Capitole","Économie","0313124C","Licence",20240238,"Droit, économie, gestion","École d'économie et de sciences sociales quantitatives de Toulouse - TSE"]
["Nîmes Université","0301687W",24,"Droit","Certificat de capacité d’orthoptiste","Carrières sociales - IUT de Figeac","Commercialisation de produits et services","Administration publique","Droit","Arts plastiques","Assurance, banque, finance : chargé de clientèle","Gestion et maintenance des installations énergétiques","Carrières juridiques","Études théâtrales","Administration publique","Arts du spectacle","Chimie (BUT)","Bio-industries et biotechnologies","Gestion de projets et structures artistiques et culturels",null,null,null,null,"Université Toulouse Capitole","Gestion","0313124C","Licence",20140977,"Droit, économie, gestion","Toulouse School of Management"]
["Université Claude Bernard Lyon-I","0691774D",77,"Économie","Chimie (BUT)","Développement de projets de territoires","Droit","Arts du spectacle","Géographie et aménagement","Assurance, banque, finance : chargé de clientèle","Bio-industries et biotechnologies","Métiers de l'énergétique, de l'environnement et du génie climatique","Chimie (Licence)","Géographie et aménagement","Agronomie","Assurance, banque, finance : chargé de clientèle","Chimie (Licence)","Développement de projets de territoires","Gestion et développement des organisations, des services sportifs et de loisirs",null,null,null,null,"Université Toulouse Capitole","Mathématiques et informatique appliquées aux sciences humaines et sociales ","0313124C","Licence",20140979,"Droit, économie, gestion","Faculté d'informatique"]
["Université Clermont Auvergne","0632084Y",72,"Gestion","Chimie (Licence)","E-commerce et marketing numérique","E-commerce et marketing numérique","Assurance, banque, finance : chargé de clientèle","Gestion","Chimie","Carrières juridiques","Métiers de l'industrie : conception de produits industriels","Droit","Histoire","Animation et gestion des activités physiques, sportives ou culturelles","Certificat de capacité d’orthoptiste","Chimie analytique, contrôle, qualité, environnement","Diplôme national d'art - option Art","Histoire",null,null,null,null,"Université Toulouse Capitole","Aménagement paysager : conception, gestion, entretien","0313124C","Licence professionnelle",20160104,"Droit, économie, gestion","Facuté d'administration et communication"]
["Université de Montpellier","0342490X",72,"Gestion des entreprises et des administrations","Diplôme d’État d’audioprothésiste","Génie industriel et maintenance","Économie et gestion","Assurance, banque, finance : supports opérationnels","Gestion administrative et commerciale des organisations","Diplôme de formation générale en sciences médicales","Carrières sociales","Métiers du multimédia et de l'internet","Économie et gestion","Histoire de l'art et archéologie","Assurance, banque, finance : chargé de clientèle","Chimie (BUT)","Chimie de synthèse","Droit","Informatique",null,null,null,null,"Université Toulouse Capitole","Maintenance des systèmes industriels, de production et d'énergie","0313124C","Licence professionnelle",20200363,"Droit, économie, gestion","IUT de Rodez"]
["Université de Montpellier Paul-Valéry","0341089Z",28,"Information-communication (BUT)","Diplôme de formation générale en sciences maïeutiques","Génie mécanique et productique ","Génie civil - construction durable","Droit","Histoire","Droit","Chimie (BUT)","Métiers du tourisme : commercialisation des produits touristiques","Génie biologique","Humanités","Certificat de capacité d’orthoptiste","Chimie (Licence)","Chimie industrielle","Histoire","Langues étrangères appliquées",null,null,null,null,"Université Toulouse Capitole","Métiers de la gestion et de la comptabilité : comptabilité et gestion des entités agricoles","0313124C","Licence professionnelle",20160111,"Droit, économie, gestion","Faculté d'administration et communication"]
["Université de Perpignan Via-Domitia","0660437S",46,"Informatique (BUT)","Diplôme de formation générale en sciences médicales","Géographie et aménagement","Génie électrique et informatique industrielle ","Économie et gestion","Information-communication (BUT)","Économie","Chimie (Licence)","Qualité, hygiène, sécurité, santé, environnement","Génie chimique - génie des procédés ","Information-communication","Chimie (BUT)","Chimie analytique, contrôle, qualité, environnement","Commercialisation de produits et services","Langues, littératures et civilisations étrangères et régionales","Langues, littératures et civilisations étrangères et régionales",null,null,null,null,"Université Toulouse Capitole","Métiers de la qualité","0313124C","Licence professionnelle",20160323,"Droit, économie, gestion","IUT de Rodez"]
["Université de technologie de Tarbes","0651124U",11,"Maintenance des systèmes industriels, de production et d'énergie","Diplôme de formation générale en sciences odontologiques","Gestion de projets et structures artistiques et culturels","Génie mécanique et productique","Géographie et aménagement","Information-communication (licence)","Génie biologique","Chimie analytique, contrôle, qualité, environnement","Techniques de commercialisation","Génie industriel et maintenance ","Intervention sociale : accompagnement de publics spécifiques","Chimie (Licence)","Commerce et distribution","Diplôme d’État d’audioprothésiste","Lettres","Lettres",null,null,null,null,"Université Toulouse Capitole","Métiers du notariat","0313124C","Licence professionnelle",20160113,"Droit, économie, gestion","Faculté de droit et science politique"]
["Université Grenoble Alpes","0383546Y",87,"Mathématiques et informatique appliquées aux sciences humaines et sociales ","Diplôme de formation générale en sciences pharmaceutiques","Guide conférencier","Géographie et aménagement","Gestion des entreprises et des administrations ","Langues étrangères appliquées","Génie électrique et informatique industrielle","Chimie et physique des matériaux",null,"Géographie et aménagement","Langues étrangères appliquées","Chimie : formulation","Développement de projets de territoires","Diplôme de formation générale en sciences maïeutiques","Maintenance et technologie : contrôle industriel","Maintenance et technologie : organisation de la maintenance",null,null,null,null,"Université Toulouse Capitole","Carrières juridiques","0313124C","BUT","NOACCRED_388",null,"IUT de Rodez"]
["Université Jean Monnet Saint-Étienne","0421095M",47,"Métiers de la gestion et de la comptabilité : comptabilité et gestion des entités agricoles","Électronique, énergie électrique, automatique","Histoire","Gestion administrative et commerciale des organisations","Guide conférencier","Langues, littératures et civilisations étrangères et régionales","Génie industriel et maintenance","Commerce et distribution",null,"Gestion des entreprises et des administrations","Langues, littératures et civilisations étrangères et régionales","Commerce et distribution","Diplôme de formation générale en sciences maïeutiques","Diplôme de formation générale en sciences médicales","Management et gestion des organisations","Maîtrise de l'énergie, électricité, développement durable",null,null,null,null,"Université Toulouse Capitole","Gestion des entreprises et des administrations","0313124C","BUT","NOACCRED_446",null,"IUT de Rodez"]
["Université Jean Moulin Lyon-III","0692437Z",24,"Métiers de la qualité","Génie biologique ","Histoire de l'art et archéologie","Gestion de projets et structures artistiques et culturels","Histoire","Lettres","Génie mécanique et productique","Diplôme de formation générale en sciences maïeutiques",null,"Guide conférencier","Lettres","Commercialisation des produits alimentaires","Diplôme de formation générale en sciences médicales","Diplôme de formation générale en sciences odontologiques","Mathématiques","Management et gestion des organisations",null,null,null,null,"Université Toulouse Capitole","Information-communication (BUT)","0313124C","BUT","NOACCRED_462",null,"IUT de Rodez"]
{"$rows_left_out":773}
{"sheet":"Data des listes","index":5,"n_rows":50,"n_cols":2,"rows_kept":50,"cut":false,"hidden":true,"merged":[]}
["Référence 1 : La formation est en adéquation avec la stratégie formation de l’établissement.","Choix d'auto-positionnement"]
["C1. La formation s’inscrit dans les ambitions, dans les orientations pédagogiques et dans les priorités thématiques de l’établissement.",1]
["C2. La formation est construite en cohérence et en complémentarité avec les autres formations du même cycle et en articulation avec celles des autres cycles avec lesquelles elle s’inscrit en continuum.",2]
["C3. La formation s’assure de la réalité et de la valeur ajoutée de ses partenariats académiques locaux, régionaux et nationaux.",3]
["C4. La formation intègre l’apport de la pluridisciplinarité et de l’interdisciplinarité dans sa finalité et dans son contenu.",4]
["C5. La formation intègre les enjeux du développement durable.",5]
["C6. La formation s’appuie sur les actions menées et sur les moyens obtenus dans le cadre des projets du Programme d'investissements d'avenir (PIA), pour dynamiser son contenu et ses dispositifs."]
["Référence 2 : La formation est ouverte à l’international en cohérence avec les priorités définies par l’établissement."]
["C1. La formation développe une offre spécifique à l'international en s’assurant de la réalité et de la valeur ajoutée de ses partenariats internationaux."]
["C2. La formation inclut des mobilités entrantes et sortantes des étudiants, et bénéficie, à cet effet, d'un soutien y compris financier.  "]
["Référence 3 : La formation bénéficie d’un adossement à la recherche."]
["C1. La formation intègre une formation à et par la recherche adaptée à sa finalité. "]
["C2. Des enseignants-chercheurs et des chercheurs des disciplines de la formation participent aux enseignements."]
["C3. La formation et les unités de recherche auxquelles elle est adossée mettent en place, à l'intention des étudiants, un dispositif d’accueil, d’accompagnement et de formation par la recherche."]
["C4. La formation inclut une formation à l’intégrité scientifique et à la déontologie."]
{"$rows_left_out":35}