{"text_format":"1","workbook":"xlsx","n_sheets":7,"sheets":["Notice technique","1. Présentation","2. Données de caractérisation","3. Données et analyse","Data des listes","Nomenclature","Dev"],"not_rendered":{"charts":0,"images":2,"macros":1,"external_links":0,"defined_names":31,"comments":0,"pivot_tables":0},"unopened":[],"bounds":{"document_bytes":16777216,"sheet_cells":100000,"rows_first":2000,"rows_last":500,"rows_between":2000,"halvings":0,"cell_chars":16384,"cell_head_chars":4096},"cells_cut":0,"cells_raw":0,"read":"whole","date_system":"1900"}

{"sheet":"Notice technique","index":0,"n_rows":48,"n_cols":6,"rows_kept":48,"cut":false,"hidden":false,"merged":[[0,2,3,12],[8,1,8,18],[11,1,11,18],[12,1,12,18],[19,2,19,18],[42,1,42,18],[43,1,43,18],[22,2,22,18],[23,2,23,18],[24,2,24,18],[25,2,25,18],[38,1,38,18],[30,5,30,17]]}
[null,null,"DÉPARTEMENT D’ÉVALUATION DES FORMATIONS"]
["DEF 2e cycle","V 1.01"]
[]
[]
[]
[null,"Note d'utilisation"]
[]
[null,"Pour quelles formations ?"]
[null,"Cette trame du dossier d'autoévaluation (DAE 21) est à compléter pour toutes les formations du deuxième cycle évaluées par le Hcéres en vague A, à l'exception des diplômes en cinq ans (ENS, IEP et orthophonie) qui font l'objet d'une trame spécifique (DAE 22)."]
[]
[null,"Pourquoi cette trame du dossier d'autoévaluation ?"]
[null,"Cette trame a pour finalité de collecter, dans un même fichier, toutes les analyses, étayées par des données et un auto-positionnement, constitutives du dossier d'autoévaluation d'une formation du 2e cycle (à l'exception de celles précitées) en vue de son évaluation par le Hcéres en vague A."]
[null,"Les données attendues, pour appuyer l'analyse et l'auto-positionnement de chaque critère ou de chaque référence du référentiel d'évaluation des formations du 1er et du 2e cycle, sont de nature qualitative (données textuelles) ou quantitative (données chiffrées). Les données qualitatives sont à renseigner sous la forme d'un texte court ; les données quantitatives sont à renseigner sous forme brute (sauf indication contraire).                                                                                                                                                                                             "]
[]
[]
{"$rows_left_out":34}
{"sheet":"1. Présentation","index":1,"n_rows":906,"n_cols":6,"rows_kept":906,"cut":false,"hidden":false,"merged":[[0,1,3,4],[5,1,5,2]]}
[null,"DÉPARTEMENT D’ÉVALUATION DES FORMATIONS"]
[]
[]
[]
[]
[null,"1. Présentation de la formation"]
[]
["Code de la donnée",null,null,null,null," "]
["P1",null,"Établissement",null,null,"Sélectionner un établissement dans la liste déroulante."]
["P2",null,"Code UAI",{"$f":"IF(ISERROR(VLOOKUP($D$9,Nomenclature!$A$2:$B$25,2,FALSE)),\"\",VLOOKUP($D$9,Nomenclature!$A$2:$B$25,2,FALSE))","v":""}]
["P3",null,"Intitulé de la formation",null,null,"Sélectionner un intitulé de formation dans la liste déroulante. \nCet intitulé correspond à la liste transmise par l'établissement au Hcéres en septembre 2024."]
["P4",null,"Type de cursus",{"$f":"IF(ISERROR(INDEX(Nomenclature!$AF$2:$AF$678,MATCH(1,(Nomenclature!$AC$2:$AC$678=$D$9)*(Nomenclature!$AD$2:$AD$678=$D$11),0))),\"\",(INDEX(Nomenclature!$AF$2:$AF$678,MATCH(1,(Nomenclature!$AC$2:$AC$678=$D$9)*(Nomenclature!$AD$2:$AD$678=$D$11),0))))","v":""}]
["P5",null,"Composante de rattachement",null,null,"Saisir le nom de la ou des composantes de rattachement (UFR, école, institut) si elle(s) existe(nt). Ne pas inclure le nom des structures internes aux composantes (ex. département). Ne pas saisir d'autres types d'information (ex. données sur l'équipe pédagogique)."]
["P6",null,"Lieu(x) de formation (y compris des parcours diplômants délocalisés)",null,null,"Indiquer la ou les villes où est dispensée la formation."]
["P7",null,"Numéro d'accréditation",{"$f":"IF(ISERROR(INDEX(Nomenclature!$AG$2:$AG$678,MATCH(1,(Nomenclature!$AC$2:$AC$678=$D$9)*(Nomenclature!$AD$2:$AD$678=$D$11),0))),\"\",(INDEX(Nomenclature!$AG$2:$AG$678,MATCH(1,(Nomenclature!$AC$2:$AC$678=$D$9)*(Nomenclature!$AD$2:$AD$678=$D$11),0))))","v":""}]
{"$rows_left_out":892}
{"sheet":"2. Données de caractérisation","index":2,"n_rows":24,"n_cols":9,"rows_kept":24,"cut":false,"hidden":false,"merged":[[0,1,3,5],[5,1,5,5],[6,5,6,9],[7,1,7,2],[9,1,9,2]]}
[null,"DÉPARTEMENT D’ÉVALUATION DES FORMATIONS"]
[]
[]
[]
[]
[null,{"$f":"IF('1. Présentation'!D11<>\"\",'1. Présentation'!D11,\"\")","v":""}]
[]
[null,"2. Données de caractérisation de la formation"]
[]
[null,"Données de caractérisation",null,"Année \n2021-2022","Année \n2022-2023","Année \n2023-2024","Précisions sur la définition et/ou le mode de calcul de la donnée\n (en particulier, lorsque les éléments présents dans le système d'information de l'établissement (SI) ne correspondent pas aux éléments indiqués par le Hcéres)\n(500 caractères maximum)"]
["IG1","DC 1","Nombre total d’inscrits administratifs dans la formation (dans tout le cycle)*",null,null,null,null,null,"IG1"]
[null,"DC 2","dont étudiants internationaux*"]
[null,"DC 3","dont étudiants ayant des besoins spécifiques et bénéficiant d'un aménagement d'études"]
["IG1","DC 4","Nombre total d’hommes inscrits dans la formation (inscrits administratifs dans tout le cycle)",null,null,null,null,null,"IG1"]
["IG1","DC 5","Nombre total de femmes inscrites dans la formation (inscrits administratifs dans tout le cycle)",null,null,null,null,null,"IG1"]
{"$rows_left_out":10}
{"sheet":"3. Données et analyse","index":3,"n_rows":116,"n_cols":13,"rows_kept":116,"cut":false,"hidden":false,"merged":[[0,1,3,2],[1,3,4,9],[5,1,5,2],[23,11,24,11],[26,2,27,2],[26,10,27,10],[26,11,27,11],[5,10,8,10],[5,11,8,11],[7,1,7,2],[8,1,8,4],[10,2,11,2],[10,3,11,3],[10,4,11,4],[10,5,11,5],[10,6,11,6],[28,2,30,2],[28,10,30,10],[10,7,10,9],[10,10,11,10],[10,11,11,11],[10,12,11,12],[12,1,45,1],[20,2,22,2],[20,10,22,10],[20,11,22,11],[23,2,24,2],[23,10,24,10],[28,11,30,11],[35,2,36,2],[35,10,36,10],[35,11,36,11],[37,2,39,2],[37,10,39,10],[37,11,39,11],[41,2,45,2],[41,10,45,10],[41,11,45,11],[46,1,73,1],[47,2,48,2],[47,10,48,10],[47,11,48,11],[49,2,51,2],[49,10,51,10],[49,11,51,11],[57,2,63,2],[57,10,63,10],[57,11,63,11],[66,2,71,2],[66,10,71,10],[66,11,71,11],[72,2,73,2],[72,10,73,10],[72,11,73,11],[74,1,96,1],[76,2,77,2],[76,10,77,10],[76,11,77,11],[79,2,83,2],[79,10,83,10],[79,11,83,11],[85,2,96,2],[85,10,96,10],[85,11,96,11],[97,1,111,1],[98,2,99,2],[98,10,99,10],[98,11,99,11],[100,2,101,2],[100,10,101,10],[100,11,101,11],[103,2,106,2],[103,10,106,10],[103,11,106,11],[110,2,111,2],[110,10,111,10],[110,11,111,11]]}
[null,"DÉPARTEMENT D’ÉVALUATION DES FORMATIONS"]
[]
[]
[]
[]
[null,{"$f":"IF('1. Présentation'!D11<>\"\",'1. Présentation'!D11,\"\")","v":""},null,null,null,null,null,null,null,null,"*Pour une définition des niveaux de la grille d'auto-positionnement, voir le tableau à droite","*Prise en compte des recommandations du Hcéres ; explication des résultats, des difficultés, des freins et des leviers ; explication des évolutions passées ou à venir ; mesures correctives proposées"]
[]
[null,"3. Données et analyse"]
[null,"Cet onglet permet de présenter l’autoévaluation de la formation, en s’appuyant sur une analyse (colonne L) et un auto-positionnement (colonne K) menés par l’équipe pédagogique pour chaque critère ou référence du référentiel d'évaluation des formations du 1er et du 2e cycle. Celles-ci sont étayées par des données qualitatives (colonnes E et F) et des données quantitatives (colonnes G à J). Pour autoévaluer chaque critère ou référence, renseigner, dans les colonnes prévues, les données qualitatives, les analyses et l'auto-positionnement, ainsi que, pour chaque année de référence, les données quantitatives qui s'y rapportent. Lorsque la donnée quantitative est invariante dans la période de référence, indiquer la valeur correspondant à l'année 2023-2024 (colonne J), les autres cases étant grisées."]
[]
[null,null,"Référentiel d'évaluation des formations du 1er et du 2e cycle","Code de la donnée","Repères pour les données qualitatives","Données qualitatives \n(1000 caractères maximum)","Données quantitatives","Valeur pour chaque année de la période de référence",null,null,"Auto-positionnement\n\nNiveau atteint :\n 1, 2, 3, 4, 5 *","Analyse obligatoire \nde l'auto-positionnement \net des données qualitatives \net quantitatives *\n\n(1 500 caractères maximum)","Précisions sur la définition et/ou le mode de calcul de la donnée \n(en particulier, lorsque les éléments présents dans le SI de l'établissement ou de tous les établissements co-accrédités ne correspondent pas aux éléments indiqués par le Hcéres)\n(500 caractères maximum)"]
[null,null,null,null,null,null,null,"Année 2021-2022","Année 2022-2023","Année 2023-2024"]
[" pour initier aux enjeux de la transition écologique en cohérence avec des référentiels nationaux et européens ;","Domaine 1 : \nLa politique et la caractérisation de la formation","Référence 1 : La formation est en adéquation avec la stratégie de formation de l’établissement."]
[null,null,"C1. La formation définit ses objectifs et ses débouchés, en cohérence avec les ambitions, les orientations pédagogiques et les priorités thématiques de l’établissement.","Document 1","Critère évalué sur la base du document n°1 ayant valeur de preuve "]
[null,null,"C2. La formation est construite en cohérence et en complémentarité avec les autres formations du même cycle et en articulation avec celles des autres cycles avec lesquelles elle s’inscrit en continuum, au sein de l'établissement et/ou du site.","Document 1","Critère évalué sur la base du document n°1 ayant valeur de preuve "]
{"$rows_left_out":102}
{"sheet":"Data des listes","index":4,"n_rows":50,"n_cols":2,"rows_kept":50,"cut":false,"hidden":true,"merged":[]}
["Référence 1 : La formation est en adéquation avec la stratégie de formation de l’établissement.","Choix d'auto-positionnement"]
["C1. La formation s’inscrit dans les ambitions, les orientations pédagogiques et les priorités thématiques de l’établissement.",1]
["C2. La formation est construite en cohérence et complémentarité avec les autres formations du même cycle et en articulation avec celles des autres cycles avec lesquelles elle s’inscrit en continuum.",2]
["C3. La formation s’assure de la réalité et de la valeur ajoutée de ses partenariats académiques locaux, régionaux et nationaux.",3]
["C4. La formation intègre l’apport de la pluridisciplinarité et de l’interdisciplinarité dans sa finalité et dans son contenu.",4]
["C5. La formation intègre les enjeux du développement durable.",5]
["C6. La formation s’appuie sur les actions menées et sur les moyens obtenus dans le cadre des projets du Programme d'investissements d'avenir (PIA), pour dynamiser son contenu et ses dispositifs."]
["Référence 2 : La formation est ouverte à l’international en cohérence avec les priorités définies par l’établissement."]
["C1. La formation développe une offre spécifique à l'international en s’assurant de la réalité et de la valeur ajoutée de ses partenariats internationaux."]
["C2. La formation inclut des mobilités entrantes et sortantes des étudiants, et bénéficie, à cet effet, d'un soutien y compris financier."]
["Référence 3 : La formation bénéficie d’un adossement à la recherche."]
["C1. La formation intègre une formation à et par la recherche adaptée à sa finalité. "]
["C2. Des enseignants-chercheurs et chercheurs des disciplines de la formation participent aux enseignements."]
["C3. La formation et les unités de recherche auxquelles elle est adossée mettent en place, à l'intention des étudiants, un dispositif d’accueil, d’accompagnement et de formation par la recherche des étudiants."]
["C4. La formation inclut une formation à l’intégrité scientifique et à la déontologie."]
{"$rows_left_out":36}
{"sheet":"Nomenclature","index":5,"n_rows":678,"n_cols":35,"rows_kept":678,"cut":false,"hidden":true,"merged":[]}
["Établissements","Codes UAI",null,"Université Toulouse Capitole","Université Toulouse 3 - Paul Sabatier","Université Toulouse 2 - Jean Jaurès","Université Savoie Mont Blanc","Université Lumière Lyon-II","Université Jean Moulin Lyon-III","Université Jean Monnet Saint-Étienne","Université Grenoble Alpes","Université de Perpignan Via-Domitia","Université de Montpellier Paul-Valéry","Université de Montpellier","Université Clermont Auvergne","Université Claude Bernard Lyon-I","Nîmes Université","Institut national universitaire Jean-François Champollion","Institut national polytechnique de Toulouse","Institut national des sciences appliquées de Toulouse","Institut national d'enseignement supérieur pour l'agriculture, l'alimentation et l'environnement","École normale supérieure de Lyon","École nationale supérieure des sciences de l'information et des bibliothèques","École nationale supérieure de formation de l'enseignement agricole","École nationale de l'aviation civile","École centrale de Lyon","Institut Mines-Télécom",null,"Libellé établissement","Intitulé indiqué dans l'arr\u0090té d'accréditation","Code UAI Etablissement","Type de formation indiqué dans l'arr\u0090té d'accréditation","Numéro d'accréditation de la mention","Domaine indiqué dans l'arr\u0090té d'accréditation","Composante de rattachement"]
["École centrale de Lyon","0690187D",4,"Administration économique et sociale","Biodiversité, écologie et évolution","Anthropologie","Chimie","Administration publique","Administration et liquidation d'entreprises en difficulté","Analyse et politique économiques","Arts, lettres et civilisations","Administration publique","Administration et échanges internationaux","Administration publique","Administration économique et sociale","Actuariat","Administration économique et sociale","Audiovisuel, médias interactifs numériques, jeux","Diplôme national d'œnologue","Ingénierie des systèmes complexes","Diplôme national d'œnologue","Arts","Histoire, civilisations, patrimoine","Métiers de l'enseignement, de l'éducation et de la formation (MEEF), 2nd degré","Aéronautique et espace","Acoustique","Génie industriel",null,"Université Toulouse Capitole","Administration économique et sociale","0313124C","Master",20200364,"Droit, économie, gestion","Faculté d'administration et communication"]
["École nationale de l'aviation civile","0311256X",3,"Administration et liquidation d'entreprises en difficulté","Bio-informatique","Archéologie, sciences pour l'archéologie","Droit des affaires","Analyse et politique économiques","Archives","Arts","Biodiversité, écologie et évolution","Archéologie, sciences pour l'archéologie","Anthropologie","Biodiversité, écologie et évolution","Administration publique","Automatique, robotique","Design","Droit de l'entreprise","Génie industriel",null,"Sciences de la vigne et du vin","Biologie","Sciences de l'information et des bibliothèques",null,"Ingénierie des systèmes électroniques de la sécurité aérienne","Aéronautique et espace",null,null,"Université Toulouse Capitole","Administration et liquidation d'entreprises en difficulté","0313124C","Master",20171074,"Droit, économie, gestion","Faculte de droit et science politique"]
["École nationale supérieure de formation de l'enseignement agricole","0310143M",1,"Comptabilité - contrôle - audit","Biologie moléculaire et cellulaire","Arts de la scène et du spectacle vivant","Droit international","Anthropologie","Audiovisuel, médias interactifs numériques, jeux","Comptabilité - contrôle - audit","Biologie","Calcul haute performance, simulation","Archéologie et histoire des mondes anciens","Bio-informatique","Automatique, robotique","Biochimie, biologie moléculaire","Diplôme national supérieur d'expression plastique - option Art","Droit public",null,null,"Sciences et technologie de l'agriculture, de l'alimentation et de l'environnement","Didactique des sciences",null,null,"Management et contrôle du trafic aérien","Nanosciences et nanotechnologies",null,null,"Université Toulouse Capitole","Comptabilité - contrôle - audit","0313124C","Master",20160050,"Droit, économie, gestion","Toulouse School of Management"]
["École nationale supérieure des sciences de l'information et des bibliothèques","0692459Y",2,"Contrôle de gestion et audit organisationnel","Biologie végétale","Cinéma et audiovisuel","Droit notarial","Archéologie, sciences pour l'archéologie","Comptabilité - contrôle - audit","Contrôle de gestion et audit organisationnel","Biologie végétale","Chimie","Arts de la scène et du spectacle vivant","Biologie, agrosciences","Bio-informatique","Biodiversité, écologie et évolution","Droit des affaires","Études européennes et internationales",null,null,null,"Économie",null,null,null,"Sciences et génie des matériaux",null,null,"Université Toulouse Capitole","Contrôle de gestion et audit organisationnel","0313124C","Master",20160051,"Droit, économie, gestion","Toulouse School of Management"]
["École normale supérieure de Lyon","0694123G",10,"Droit de la santé","Biologie-santé","Civilisations, cultures et sociétés","Droit privé","Arts de la scène et du spectacle vivant","Contrôle de gestion et audit organisationnel","Design","Chimie","Civilisations, cultures et sociétés","Arts plastiques","Biologie-santé","Biologie végétale","Bio-informatique","Droit des collectivités territoriales","Gestion de l'environnement",null,null,null,"Études européennes et internationales",null,null,null,null,null,null,"Université Toulouse Capitole","Droit de la santé","0313124C","Master",20160053,"Droit, économie, gestion","Faculté de droit et science politique"]
["Institut Mines-Télécom","0912424R",1,"Droit de l'immobilier","Biotechnologies","Création artistique","Droit public","Cinéma et audiovisuel","Droit bancaire et financier","Didactique des langues","Comptabilité - contrôle - audit","Comptabilité - contrôle - audit","Cinéma et audiovisuel","Chimie","Biologie-santé","Biologie intégrative et physiologie","Histoire, civilisations, patrimoine","Histoire",null,null,null,"Histoire de la philosophie",null,null,null,null,null,null,"Université Toulouse Capitole","Droit de l'immobilier","0313124C","Master",20160052,"Droit, économie, gestion","Faculté de droit et science politique"]
["Institut national d'enseignement supérieur pour l'agriculture, l'alimentation et l'environnement","0756246G",3,"Droit des affaires","Chimie","Création littéraire","Énergie solaire","Communication des organisations","Droit de la santé","Diplôme de formation approfondie en sciences médicales","Contrôle de gestion et audit organisationnel","Droit comparé","Communication publique et politique","Comptabilité - contrôle - audit","Chimie","Biologie moléculaire et cellulaire","Humanités et industries créatives","Psychologie",null,null,null,"Informatique",null,null,null,null,null,null,"Université Toulouse Capitole","Droit des affaires","0313124C","Master",20160054,"Droit, économie, gestion","Faculté de droit et science politique"]
["Institut national des sciences appliquées de Toulouse","0310152X",1,"Droit du numérique","Diplôme de formation approfondie en sciences médicales","Création numérique","Français langue étrangère","Didactique des langues","Droit des affaires","Diplôme d'État d'Infirmier en pratique avancée mention Maladie rénale chronique, dialyse, transplantation rénale","Création artistique","Droit de l'environnement et de l'urbanisme","Création numérique","Contrôle de gestion et audit organisationnel","Civilisations, cultures et sociétés","Biologie végétale","Psychologie","Ville et environnements urbains",null,null,null,"Mondes anciens",null,null,null,null,null,null,"Université Toulouse Capitole","Droit du numérique","0313124C","Master",20160055,"Droit, économie, gestion","Faculté de droit et science politique"]
["Institut national polytechnique de Toulouse","0311381H",2,"Droit du patrimoine","Diplôme de formation approfondie en sciences odontologiques","Culture et communication","Géographie","Direction de projets ou établissements culturels","Droit des assurances","Diplôme d'État d'Infirmier en pratique avancée mention Oncologie et hémato-oncologie","Design","Droit de l'immobilier","Danse","Didactique des sciences","Comptabilité - contrôle - audit","Cancer","Risques et environnement",null,null,null,null,"Sciences de la matière",null,null,null,null,null,null,"Université Toulouse Capitole","Droit du patrimoine","0313124C","Master",20160056,"Droit, économie, gestion","Faculté de droit et science politique"]
["Institut national universitaire Jean-François Champollion","0811293R",8,"Droit fiscal","Diplôme de formation approfondie en sciences pharmaceutiques","Design","Géoressources, géorisques, géotechnique","Droit des affaires","Droit européen","Diplôme d'État d'Infirmier en pratique avancée mention Pathologies chroniques stabilisées ; prévention et polypathologies courantes en soins primaires","Didactique des langues","Droit des affaires","Diplôme d'État d'architecte (DEA)","Diplôme de formation approfondie en sciences médicales","Diplôme de formation approfondie en sciences médicales","Chimie","Sciences de la vision",null,null,null,null,"Sciences sociales",null,null,null,null,null,null,"Université Toulouse Capitole","Droit fiscal","0313124C","Master",20160058,"Droit, économie, gestion","Faculté de droit et science politique"]
["Nîmes Université","0301687W",10,"Droit international et droit européen","Diplôme d'État de Sage-femme","Économie sociale et solidaire","Gestion de l'environnement","Droit privé","Droit fiscal","Diplôme d'État d'Infirmier en pratique avancée mention Psychiatrie et santé mentale","Diplôme de formation approfondie en sciences médicales","Électronique, énergie électrique, automatique","Direction de projets ou établissements culturels","Diplôme de formation approfondie en sciences odontologiques","Diplôme de formation approfondie en sciences odontologiques","Chimie et sciences des matériaux",null,null,null,null,null,null,null,null,null,null,null,null,"Université Toulouse Capitole","Droit international et droit européen","0313124C","Master",20181092,"Droit, économie, gestion","Faculté de droit et science politique"]
["Université Claude Bernard Lyon-I","0691774D",47,"Droit notarial","Diplôme d'État d'infirmier de bloc opératoire","Éthique","Informatique","Droit public","Droit international","Diplôme d'État d'Infirmier en pratique avancée mention Urgences","Diplôme de formation approfondie en sciences pharmaceutiques","Énergie solaire","Économie sociale et solidaire","Diplôme de formation approfondie en sciences pharmaceutiques","Diplôme de formation approfondie en sciences pharmaceutiques","Chimie physique et analytique",null,null,null,null,null,null,null,null,null,null,null,null,"Université Toulouse Capitole","Droit notarial","0313124C","Master",20160060,"Droit, économie, gestion","Faculté de droit et science politique"]
["Université Clermont Auvergne","0632084Y",75,"Droit pénal et sciences criminelles","Diplôme d'État d'Infirmier en pratique avancée mention Maladie rénale chronique, dialyse, transplantation rénale","Études sur le genre","Ingénierie des systèmes complexes","Droit social","Droit notarial","Droit des affaires","Diplôme d'État d'architecte (DEA)","Études culturelles","Esthétique","Diplôme d'État de Sage-femme","Diplôme d'État d'architecte (DEA)","Diplôme de formation approfondie en sciences médicales",null,null,null,null,null,null,null,null,null,null,null,null,"Université Toulouse Capitole","Droit pénal et sciences criminelles","0313124C","Master",20160063,"Droit, économie, gestion","Faculté de droit et science politique"]
["Université de Montpellier","0342490X",87,"Droit privé","Diplôme d'État d'Infirmier en pratique avancée mention Oncologie et hémato-oncologie","Français langue étrangère","Langues étrangères appliquées","Économie de l'environnement, de l'énergie et des transports","Droit pénal et sciences criminelles","Droit notarial","Diplôme d'État de sage-femme","Études européennes et internationales","Études culturelles","Diplôme d'État d'Infirmier en pratique avancée mention Maladie rénale chronique, dialyse, transplantation rénale","Diplôme d'État de sage-femme","Diplôme de formation approfondie en sciences odontologiques",null,null,null,null,null,null,null,null,null,null,null,null,"Université Toulouse Capitole","Droit privé","0313124C","Master",20160061,"Droit, économie, gestion","Faculté de droit et science politique"]
{"$rows_left_out":664}
{"sheet":"Dev","index":6,"n_rows":0,"n_cols":0,"rows_kept":0,"cut":false,"hidden":true,"merged":[]}