{"text_format":"1","workbook":"xlsx","n_sheets":7,"sheets":["Notice technique","1. Présentation","2. Données de caractérisation","3. Données et analyse","Data des listes","Nomenclature","Dev"],"not_rendered":{"charts":0,"images":2,"macros":1,"external_links":0,"defined_names":12,"comments":0,"pivot_tables":0},"unopened":[],"bounds":{"document_bytes":16777216,"sheet_cells":100000,"rows_first":2000,"rows_last":500,"rows_between":2000,"halvings":0,"cell_chars":16384,"cell_head_chars":4096},"cells_cut":0,"cells_raw":0,"read":"whole","date_system":"1900"}

{"sheet":"Notice technique","index":0,"n_rows":48,"n_cols":6,"rows_kept":48,"cut":false,"hidden":false,"merged":[[0,2,3,12],[8,1,8,18],[11,1,11,18],[12,1,12,18],[19,2,19,18],[42,1,42,18],[43,1,43,18],[22,2,22,18],[23,2,23,18],[24,2,24,18],[25,2,25,18],[38,1,38,18],[30,5,30,19]]}
[null,null,"DÉPARTEMENT D’ÉVALUATION DES FORMATIONS"]
["DEF 2e cycle","V 1.00"]
[]
[]
[]
[null,"Note d'utilisation"]
[]
[null,"Pour quelles formations ?"]
[null,"Cette trame du dossier d'autoévaluation (DAE 22) est à compléter pour les formations du deuxième cycle en cinq ans (diplôme de l'ENS, de l'IEP ou d'orthophonie) évaluées par le Hcéres en vague A. Les autres formations du deuxième cycle (masters, etc.) font l'objet d'une trame spécifique (DAE 21)."]
[]
[null,"Pourquoi cette trame du dossier d'autoévaluation ?"]
[null,"Cette trame a pour finalité de collecter, dans un même fichier, toutes les analyses, étayées par des données et un auto-positionnement, constitutives du dossier d'autoévaluation d'une formation du 2e cycle en cinq ans en vue de son évaluation par le Hcéres en vague A."]
[null,"Les données attendues, pour appuyer l'analyse et l'auto-positionnement de chaque critère ou de chaque référence du référentiel d'évaluation des formations du 1er et du 2e cycle, sont de nature qualitative (données textuelles) ou quantitative (données chiffrées). Les données qualitatives sont à renseigner sous la forme d'un texte court ; les données quantitatives sont à renseigner sous forme brute (sauf indication contraire).                                                                                                                                                                                             "]
[]
[]
[null,"Comment le remplir ?"]
[null,"Le mode d'emploi pratique pour renseigner la trame est le suivant : "]
[]
[null,"1. Activer le contenu à l'ouverture du fichier"]
[null,null,"À l'ouverture du fichier, il est indispensable d'accepter l'activation des macros (ou du contenu) lorsque le tableur vous y invite, faute de quoi le fichier ne pourra pas fonctionner correctement."]
{"$rows_left_out":29}
{"sheet":"1. Présentation","index":1,"n_rows":906,"n_cols":6,"rows_kept":906,"cut":false,"hidden":false,"merged":[[0,1,3,4],[5,1,5,2]]}
[null,"DÉPARTEMENT D’ÉVALUATION DES FORMATIONS"]
[]
[]
[]
[]
[null,"1. Présentation de la formation"]
[]
["Code de la donnée",null,null,null,null," "]
["P1",null,"Établissement",null,null,"Sélectionner un établissement dans la liste déroulante."]
["P2",null,"Code UAI",{"$f":"IF(ISERROR(VLOOKUP($D$9,Nomenclature!$A$2:$B$9,2,FALSE)),\"\",VLOOKUP($D$9,Nomenclature!$A$2:$B$9,2,FALSE))","v":""}]
["P3",null,"Intitulé de la formation",null,null,"Sélectionner un intitulé de formation dans la liste déroulante. \nCet intitulé correspond à la liste transmise par l'établissement au Hcéres en septembre 2024."]
["P4",null,"Type de cursus",{"$f":"IF(ISERROR(INDEX(Nomenclature!$P$2:$P$9,MATCH(1,(Nomenclature!$M$2:$M$9=$D$9)*(Nomenclature!$N$2:$N$9=$D$11),0))),\"\",(INDEX(Nomenclature!$P$2:$P$9,MATCH(1,(Nomenclature!$M$2:$M$9=$D$9)*(Nomenclature!$N$2:$N$9=$D$11),0))))","v":""}]
["P5",null,"Composante de rattachement",null,null,"Saisir le nom de la ou des composantes de rattachement (UFR, école, institut) si elle(s) existe(nt). Ne pas inclure le nom des structures internes aux composantes (ex. département). Ne pas saisir d'autres types d'information (ex. données sur l'équipe pédagogique)."]
["P6",null,"Lieu(x) de formation (y compris des parcours diplômants délocalisés)",null,null,"Indiquer la ou les villes où est dispensée la formation."]
["P7",null,"Numéro d'accréditation",{"$f":"IF(ISERROR(INDEX(Nomenclature!$Q$2:$Q$9,MATCH(1,(Nomenclature!$M$2:$M$9=$D$9)*(Nomenclature!$N$2:$N$9=$D$11),0))),\"\",(INDEX(Nomenclature!$Q$2:$Q$9,MATCH(1,(Nomenclature!$M$2:$M$9=$D$9)*(Nomenclature!$N$2:$N$9=$D$11),0))))","v":""}]
["P8",null,"Responsable(s) de la formation",null,null,"Indiquer le nom du ou des responsable(s) du diplôme.\n(500 caractères maximum)                      "]
["P9",null,"Nombre de parcours diplômants de la formation",null,null,"Indiquer le nombre de parcours diplômants**. Si le nombre est supérieur ou égal à 2, il correspondra aux lignes qui seront ajoutées automatiquement dans les données déclinées par parcours diplômant (marquées d'un astérisque). Cette opération peut prendre quelques instants voire plus, notamment lorsque le nombre de parcours est important.                                                                                                                                   Si vous modifiez le nombre de parcours en augmentant la valeur déjà saisie, des lignes supplémentaires seront ajoutées dans l’ensemble des onglets. En revanche, il n’est pas possible de modifier le nombre de parcours à la baisse pour éviter toute perte d’informations dans le DAE ; il vous faudra dans ce cas recommencer la saisie.\nPour les formations ayant un tronc commun à plusieurs parcours diplômants au sein d'un même diplôme (ex. 1re année commune), compter le tronc commun comme un parcours diplômant dans le calcul du nombre de parcours diplômants.\n"]
["P10",null,"Intitulé des parcours diplômants",null,null,"Indiquer l'intitulé des parcours en vigueur en 2023-2024. Si cet intitulé a été modifié durant la période de l'évaluation, le préciser dans la présentation de la formation (document ayant valeur de preuve n°1).\n(500 caractères maximum)"]
["P11",null,"Éléments différenciants de la formation",null,null,"Préciser les particularités de la formation (ex. des parcours diplômant(s)) devant être prises en considération pour la compréhension de l'analyse des données de la formation (ex. parcours diplômant exclusivement réservé aux étudiants internationaux ou au public de la formation continue, exclusivement ou partiellement ouvert à l'alternance, proposé entièrement à distance, etc.).\n(500 caractères maximum)"]
[]
{"$rows_left_out":887}
{"sheet":"2. Données de caractérisation","index":2,"n_rows":25,"n_cols":9,"rows_kept":25,"cut":false,"hidden":false,"merged":[[0,1,3,5],[5,1,5,5],[6,5,6,9],[7,1,7,2],[9,1,9,2]]}
[null,"DÉPARTEMENT D’ÉVALUATION DES FORMATIONS"]
[]
[]
[]
[]
[null,{"$f":"IF('1. Présentation'!D11<>\"\",'1. Présentation'!D11,\"\")","v":""}]
[]
[null,"2. Données de caractérisation de la formation"]
[]
[null,"Données de caractérisation",null,"Année \n2021-2022","Année \n2022-2023","Année \n2023-2024","Précisions sur la définition et/ou le mode de calcul de la donnée \n(en particulier, lorsque les éléments présents dans le système d'information (SI) de l'établissement ne correspondent pas aux éléments indiqués par le Hcéres)\n(500 caractères maximum)"]
["IG1","DC 1","Nombre total d’inscrits administratifs dans la formation*",null,null,null,null,null,"IG1"]
[null,"DC 2","dont étudiants internationaux*"]
[null,"DC 3","dont étudiants ayant des besoins spécifiques et bénéficiant d'un aménagement d'études"]
["IG1","DC 4","Nombre total d’hommes inscrits dans la formation (inscrits administratifs)",null,null,null,null,null,"IG1"]
["IG1","DC 5","Nombre total de femmes inscrites dans la formation (inscrits administratifs)",null,null,null,null,null,"IG1"]
[null,"DC 6a","Nombre total d’inscrits administratifs en 1re année"]
[null,"DC 6b","Nombre total d’inscrits administratifs en 2e année"]
[null,"DC 6c","Nombre total d’inscrits administratifs en 3e année"]
[null,"DC 6d","Nombre total d’inscrits administratifs en 4e année*"]
[null,"DC 6e","Nombre total d’inscrits administratifs en 5e année*"]
{"$rows_left_out":6}
{"sheet":"3. Données et analyse","index":3,"n_rows":120,"n_cols":13,"rows_kept":120,"cut":false,"hidden":false,"merged":[[10,7,10,9],[10,10,11,10],[10,11,11,11],[0,1,3,2],[1,3,4,9],[5,1,5,2],[5,10,8,10],[5,11,8,11],[7,1,7,2],[8,1,8,4],[10,2,11,2],[10,3,11,3],[10,4,11,4],[10,5,11,5],[10,6,11,6],[12,14,12,19],[13,14,13,19],[15,14,18,14],[19,14,19,19],[10,12,11,12],[10,14,10,19],[11,14,11,19],[20,11,22,11],[20,14,20,19],[35,2,36,2],[35,10,36,10],[35,11,36,11],[28,10,30,10],[28,11,30,11],[12,1,45,1],[23,2,24,2],[23,10,24,10],[23,11,24,11],[26,2,27,2],[26,10,27,10],[26,11,27,11],[28,2,30,2],[37,2,39,2],[37,10,39,10],[37,11,39,11],[41,2,45,2],[41,10,45,10],[41,11,45,11],[20,2,22,2],[20,10,22,10],[46,1,73,1],[47,2,48,2],[47,10,48,10],[47,11,48,11],[49,2,51,2],[49,10,51,10],[49,11,51,11],[72,2,73,2],[72,10,73,10],[72,11,73,11],[57,2,63,2],[57,10,63,10],[57,11,63,11],[66,2,71,2],[66,10,71,10],[66,11,71,11],[99,1,115,1],[100,2,101,2],[100,10,101,10],[100,11,101,11],[102,2,103,2],[102,10,103,10],[102,11,103,11],[105,2,110,2],[105,10,110,10],[105,11,110,11],[114,2,115,2],[114,10,115,10],[114,11,115,11],[74,1,98,1],[76,2,77,2],[76,10,77,10],[76,11,77,11],[79,2,85,2],[79,10,85,10],[79,11,85,11],[87,2,98,2],[87,10,98,10],[87,11,98,11]]}
[null,"DÉPARTEMENT D’ÉVALUATION DES FORMATIONS"]
[]
[]
[]
[]
[null,{"$f":"IF('1. Présentation'!D11<>\"\",'1. Présentation'!D11,\"\")","v":""},null,null,null,null,null,null,null,null,"*Pour une définition des niveaux de la grille d'auto-positionnement, voir le tableau à droite","*Prise en compte des recommandations du Hcéres ; explication des résultats, des freins et des leviers ; explication des évolutions passées ou à venir ; mesures correctives proposées"]
[]
[null,"3. Données et analyse"]
[null,"Cet onglet permet de présenter l’autoévaluation de la formation, en s’appuyant sur une analyse (colonne L) et un auto-positionnement (colonne K) menés par l’équipe pédagogique pour chaque critère ou référence du référentiel d'évaluation des formations du 1er et du 2e cycle. Celles-ci sont étayées par des données qualitatives (colonnes E et F) et des données quantitatives (colonnes G à J). Pour autoévaluer chaque critère ou référence, renseigner, dans les colonnes prévues, les données qualitatives, les analyses et l'auto-positionnement, ainsi que, pour chaque année de référence, les données quantitatives qui s'y rapportent. Lorsque la donnée quantitative est invariante dans la période de référence, indiquer la valeur correspondant à l'année 2023-2024 (colonne J), les autres cases étant grisées."]
[]
[null,null,"Référentiel d'évaluation des formations du 1er et du 2e cycle","Code de la donnée","Repères pour les données qualitatives","Données qualitatives \n(1000 caractères maximum)","Données quantitatives","Valeur pour chaque année de la période de référence",null,null,"Auto-positionnement\n\nNiveau atteint : \n1, 2, 3, 4, 5 *","Analyse obligatoire\n de l'auto-positionnement\n et des données qualitatives \net quantitatives *\n\n(1 500 caractères maximum)","Précisions sur la définition et/ou le mode de calcul de la donnée \n(en particulier, lorsque les éléments présents dans le SI de l'établissement ne correspondent pas aux éléments indiqués par le Hcéres)\n(500 caratères maximum)"]
[null,null,null,null,null,null,null,"Année 2021-2022","Année 2022-2023","Année 2023-2024"]
[" pour initier aux enjeux de la transition écologique en cohérence avec des référentiels nationaux et européens ;","Domaine 1 : \nLa politique et la caractérisation de la formation","Référence 1 : La formation est en adéquation avec la stratégie de formation de l’établissement."]
[null,null,"C1. La formation définit ses objectifs et ses débouchés, en cohérence avec les ambitions, les orientations pédagogiques et les priorités thématiques de l’établissement.","Document 1","Critère évalué sur la base du document n°1 ayant valeur de preuve "]
[null,null,"C2. La formation est construite en cohérence et en complémentarité avec les autres formations du même cycle et en articulation avec celles des autres cycles avec lesquelles elle s’inscrit en continuum, au sein de l'établissement et/ou du site. ","Document 1","Critère évalué sur la base du document n°1 ayant valeur de preuve "]
[null,null,"C3. La formation s’assure de la réalité et de la valeur ajoutée de ses partenariats avec d'autres établissements d'enseignement supérieur et de recherche, au niveau local, régional et national. ","DQL 1-3","Principaux éléments de collaboration entre les équipes pédagogiques dans le cadre de parcours construits en partenariat (ex. échanges d'enseignants, interventions dans les enseignements, projets communs, etc.) ou en co-diplomation (existence d'une équipe pédagogique commune, d'enseignements communs, de modalités de pilotage commun de la formation, comme les jurys, etc.)"]
[null,null,"C4. La formation intègre l’apport de la pluridisciplinarité** et de l’interdisciplinarité** dans sa finalité et dans son contenu.","DQL 1-4","Principales actions menées en faveur de la pluridiscplinarité et/ou de l'interdisciplinarité dans la formation (parcours diplômants, disciplines concernées, dispositifs pédagogiques, exemples d'enseignements ou de projets, etc.)"]
[null,null,"C5. La formation intègre les enjeux de la transition écologique, en cohérence avec le Plan climat-biodiversité et transition écologique** de l’Enseignement supérieur et de la Recherche.","DQL 1-5","Compétences visées par la formation pour initier aux enjeux de la transition écologique en cohérence avec des référentiels nationaux (notamment le Plan climat-biodiversité et transition écologique) et européens ; modalités de formation (enseignements disciplinaires ou transversaux dédiés, enseignements transversaux, projets, etc.)"]
[null,null,"C6. La formation s’appuie sur les actions menées et sur les moyens obtenus dans le cadre des projets du Programme d'investissements d'avenir (PIA)** et de France 2030**, pour dynamiser son contenu et ses dispositifs.","DQL 1-6","Dispositifs  financés par les projets du PIA et/ou de France 2030 (parcours, heures d'enseignement, innovation pédagogique, écoles d'été, etc.)"]
[null,null,"Référence 2 : La formation est ouverte à l’international en cohérence avec les priorités définies par l’établissement."]
{"$rows_left_out":101}
{"sheet":"Data des listes","index":4,"n_rows":50,"n_cols":2,"rows_kept":50,"cut":false,"hidden":true,"merged":[]}
["Référence 1 : La formation est en adéquation avec la stratégie de formation de l’établissement.","Choix d'auto-positionnement"]
["C1. La formation s’inscrit dans les ambitions, les orientations pédagogiques et les priorités thématiques de l’établissement.",1]
["C2. La formation est construite en cohérence et complémentarité avec les autres formations du même cycle et en articulation avec celles des autres cycles avec lesquelles elle s’inscrit en continuum.",2]
["C3. La formation s’assure de la réalité et de la valeur ajoutée de ses partenariats académiques locaux, régionaux et nationaux.",3]
["C4. La formation intègre l’apport de la pluridisciplinarité et de l’interdisciplinarité dans sa finalité et dans son contenu.",4]
["C5. La formation intègre les enjeux du développement durable.",5]
["C6. La formation s’appuie sur les actions menées et sur les moyens obtenus dans le cadre des projets du Programme d'investissements d'avenir (PIA), pour dynamiser son contenu et ses dispositifs."]
["Référence 2 : La formation est ouverte à l’international en cohérence avec les priorités définies par l’établissement."]
["C1. La formation développe une offre spécifique à l'international en s’assurant de la réalité et de la valeur ajoutée de ses partenariats internationaux."]
["C2. La formation inclut des mobilités entrantes et sortantes des étudiants, et bénéficie, à cet effet, d'un soutien y compris financier."]
["Référence 3 : La formation bénéficie d’un adossement à la recherche."]
["C1. La formation intègre une formation à et par la recherche adaptée à sa finalité. "]
["C2. Des enseignants-chercheurs et chercheurs des disciplines de la formation participent aux enseignements."]
["C3. La formation et les unités de recherche auxquelles elle est adossée mettent en place, à l'intention des étudiants, un dispositif d’accueil, d’accompagnement et de formation par la recherche des étudiants."]
["C4. La formation inclut une formation à l’intégrité scientifique et à la déontologie."]
["C5. La formation à et par la recherche au sein de la formation s’appuie sur les services de documentation, en matière de contribution de leurs personnels aux contenus de formation, d’acquisition de ressources, d’accès des étudiants à celles-ci."]
["Référence 4 : La formation entretient des relations avec le monde social, économique et culturel, et intègre des éléments de professionnalisation."]
["C1. La formation prend en compte les besoins sociaux, économiques et culturels du territoire pour définir ses débouchés, sa finalité et ses contenus, en cohérence avec sa fiche RNCP. Elle associe les acteurs sociaux, économiques et culturels à cette démarche et valorise auprès d'eux les compétences auxquelles elle forme."]
["C2. La formation associe les acteurs sociaux, économiques et culturels à ses activités pédagogiques"]
["C3. La formation définit sa politique en matière d’alternance et de formation continue en lien avec le positionnement et la stratégie de l’établissement."]
{"$rows_left_out":31}
{"sheet":"Nomenclature","index":5,"n_rows":10,"n_cols":19,"rows_kept":10,"cut":false,"hidden":true,"merged":[]}
["Établissements","Codes UAI",null,"Université Toulouse Capitole","Université Toulouse 3 - Paul Sabatier","Université Grenoble Alpes","Université de Montpellier","Université Clermont Auvergne","Université Claude Bernard Lyon-I","Institut d'études politiques de Lyon","École normale supérieure de Lyon",null,"Libellé établissement","Intitulé indiqué dans l'arr\u0090té d'accréditation","Code UAI Etablissement","Type de formation indiqué dans l'arr\u0090té d'accréditation","Numéro d'accréditation de la mention","Domaine indiqué dans l'arr\u0090té d'accréditation","Composante de rattachement"]
["École normale supérieure de Lyon","0694123G",1,"Diplôme de fin d'études de l'Institut d'études politiques de Toulouse","Certificat de capacité d’orthophoniste","Diplôme de fin d'études de l'Institut d'études politiques de Grenoble","Certificat de capacité d’orthophoniste","Certificat de capacité d’orthophoniste","Certificat de capacité d’orthophoniste","Diplôme de fin d'études de l'Institut d'études politiques de Lyon","Diplôme de l'École normale supérieure de Lyon",null,"Université Toulouse Capitole","Diplôme de fin d'études de l'Institut d'études politiques de Toulouse","0313124C","Diplôme d'IEP","NOACCRED_679",null,"Institut d'études politiques de Toulouse"]
["Institut d'études politiques de Lyon","0690173N",1,null,null,null,null,null,null,null,null,null,"Université Toulouse 3 - Paul Sabatier","Certificat de capacité d’orthophoniste","0311384L","Diplôme d'État","NOACCRED_572",null,"Faculté de Santé"]
["Université Claude Bernard Lyon-I","0691774D",1,null,null,null,null,null,null,null,null,null,"Université Grenoble Alpes","Diplôme de fin d'études de l'Institut d'études politiques de Grenoble","0383546Y","Diplôme d'IEP","ESRS1818795A","Sciences humaines et sociales"]
["Université Clermont Auvergne","0632084Y",1,null,null,null,null,null,null,null,null,null,"Université de Montpellier","Certificat de capacité d’orthophoniste","0342490X","Certificat","NOACCRED_522","Santé","MEDECINE"]
["Université de Montpellier","0342490X",1,null,null,null,null,null,null,null,null,null,"Université Clermont Auvergne","Certificat de capacité d’orthophoniste","0632084Y","Diplôme d'État","NOACCRED_571",null,"UFR Médecine et des Professions Paramédicales"]
["Université Grenoble Alpes","0383546Y",1,null,null,null,null,null,null,null,null,null,"Université Claude Bernard Lyon-I","Certificat de capacité d’orthophoniste","0691774D","Diplôme d'État","NOACCRED_570","Santé","Institut des sciences et techniques de la réadaptation (ISTR)"]
["Université Toulouse 3 - Paul Sabatier","0311384L",1,null,null,null,null,null,null,null,null,null,"Institut d'études politiques de Lyon","Diplôme de fin d'études de l'Institut d'études politiques de Lyon","0690173N","Diplôme d'IEP","NOACCRED_632"]
["Université Toulouse Capitole","0313124C",1,null,null,null,null,null,null,null,null,null,"École normale supérieure de Lyon","Diplôme de l'École normale supérieure de Lyon","0694123G","Diplôme de l'ENS","NOACCRED_627",null,"École normale supérieure de Lyon"]
[null,null,8]

{"sheet":"Dev","index":6,"n_rows":0,"n_cols":0,"rows_kept":0,"cut":false,"hidden":true,"merged":[]}