{"text_format":"1","workbook":"xlsx","n_sheets":7,"sheets":["Notice technique","1. Présentation","2. Données de caractérisation","3. Données","Nomenclature","Dev","Data des listes"],"not_rendered":{"charts":0,"images":2,"macros":1,"external_links":0,"defined_names":22,"comments":0,"pivot_tables":0},"unopened":[],"bounds":{"document_bytes":16777216,"sheet_cells":100000,"rows_first":2000,"rows_last":500,"rows_between":2000,"halvings":0,"cell_chars":16384,"cell_head_chars":4096},"cells_cut":0,"cells_raw":0,"read":"whole","date_system":"1900"}

{"sheet":"Notice technique","index":0,"n_rows":39,"n_cols":3,"rows_kept":39,"cut":false,"hidden":false,"merged":[[0,2,3,12],[8,1,8,20],[14,2,14,18],[18,2,18,20],[34,1,34,20],[27,2,27,12]]}
[null,null,"DÉPARTEMENT D’ÉVALUATION DES FORMATIONS"]
["DEF 3e cycle","V 1.00"]
[]
[]
[]
[null,"Note d'utilisation"]
[]
[null,"Pourquoi ce tableau de données ?"]
[null,"Ce tableau a pour finalité de collecter les données quantitatives et d'auto-positionnement, qui étayent l'analyse des critères et des références du référentiel d'évaluation des formations du 3e cycle. Il forme partie, avec le rapport d'autoévaluation et les six documents ayant valeur de preuve, du dossier d'autoévaluation d'une formation du troisième cycle en vue de son évaluation par le Hcéres en vague A."]
[]
[null,"Comment le remplir ?"]
[null,"Le mode d'emploi pratique est le suivant."]
[]
[null,"1. Activer le contenu à l'ouverture du fichier"]
[null,null,"À l'ouverture du fichier, il est indispensable d'accepter l'activation des macros (ou du contenu) lorsque le tableur vous y invite, faute de quoi le fichier ne pourra pas fonctionner correctement."]
{"$rows_left_out":25}
{"sheet":"1. Présentation","index":1,"n_rows":903,"n_cols":6,"rows_kept":903,"cut":false,"hidden":false,"merged":[[0,1,3,4],[5,1,5,4]]}
[null,"DÉPARTEMENT D’ÉVALUATION DES FORMATIONS"]
[]
[]
[]
[]
[null,"1. Présentation de l'école doctorale"]
[]
["Code de la donnée"]
["P1","CI1","Établissement déposant",null,null,"Sélectionner un établissement dans la liste déroulante."]
["P2","CI2","Code UAI",{"$f":"IF(ISERROR(VLOOKUP($D$9,Nomenclature!$A$2:$B$17,2,FALSE)),\"\",VLOOKUP($D$9,Nomenclature!$A$2:$B$17,2,FALSE))","v":""}]
["P3","CI4","Intitulé de l'école doctorale (ED)",null,null,"Sélectionner l'intitulé de l'école doctorale dans la liste déroulante. \nCet intitulé correspond à la liste envoyée par l'établissement au Hcéres en septembre 2024."]
["P4","CI5","Numéro de l'ED",{"$f":"IF(ISERROR(INDEX(Nomenclature!$X$2:$X$64,MATCH(1,(Nomenclature!$T$2:$T$64=$D$9)*(Nomenclature!$U$2:$U$64=$D$11),0))),\"\",(INDEX(Nomenclature!$X$2:$X$64,MATCH(1,(Nomenclature!$T$2:$T$64=$D$9)*(Nomenclature!$U$2:$U$64=$D$11),0))))","v":""}]
["P5",null,"Établissements co-accrédités"]
["P6",null,"Lieu(x) de formation",null,null,"Sélectionner le(s) lieu(x) où se déroule la formation doctorale organisée par l'école doctorale"]
["P7",null,"Nombre de domaines scientifiques principaux",null,null,"Indiquer le nombre des domaines scientifiques principaux de l'ED. S'il est supérieur ou égal à 2, ceci engendrera une création de lignes qui seront ajoutées automatiquement, dans tous les onglets, pour les données déclinées par domaine, lesquelles sont marquées par un astérisque. Cette opération peut prendre quelques instants voire plus, notamment lorsque le nombre de domaines est important.\nSi vous modifiez le nombre de domaines disciplinaires en augmentant la valeur déjà saisie, des lignes supplémentaires seront ajoutées dans l’ensemble des onglets. En revanche, il n’est pas possible de modifier à la baisse le nombre de domaines pour éviter toute perte d’informations dans le DAE ; il vous faudra dans ce cas recommencer la saisie du fichier.\n"]
{"$rows_left_out":889}
{"sheet":"2. Données de caractérisation","index":2,"n_rows":25,"n_cols":9,"rows_kept":25,"cut":false,"hidden":false,"merged":[[0,1,3,2],[5,1,5,2],[7,1,7,2],[7,4,7,9],[9,1,9,2]]}
[null,"DÉPARTEMENT D’ÉVALUATION DES FORMATIONS"]
[]
[]
[]
[]
[null,{"$f":"IF('1. Présentation'!D11<>\"\",'1. Présentation'!D11,\"\")","v":""}]
[]
[null,"2. Données de caractérisation de l'école doctorale"]
[]
[null,"Données de caractérisation",null,"Année \n2019-2020","Année \n2020-2021","Année \n2021-2022","Année \n2022-2023","Année \n2023-2024","Précisions sur la définition et/ou le mode de calcul de la donnée \n(en particulier, lorsque les éléments présents dans le système d'information (SI) de l'établissement ou, le cas échéant, de tous les établissements co-accrédités ne correspondent pas aux éléments indiqués par le Hcéres)\n(500 caractères maximum)"]
[null,"DC 1a","Nombre total d’inscrits hommes en doctorat"]
[null,"DC 1b","Nombre total d’inscrites femmes en doctorat "]
[null,"DC 2a","Nombre de doctorants inscrits en 1re année de thèse"]
[null,"DC 2b","Nombre de doctorants inscrits en 2e année de thèse"]
[null,"DC 2c","Nombre de doctorants inscrits en 3e année de thèse"]
{"$rows_left_out":11}
{"sheet":"3. Données","index":3,"n_rows":127,"n_cols":12,"rows_kept":127,"cut":false,"hidden":false,"merged":[[10,2,11,2],[10,3,11,3],[10,4,11,4],[10,5,11,5],[10,6,10,10],[0,1,3,2],[5,1,5,2],[7,1,7,2],[7,3,8,3],[8,1,8,2],[28,3,29,3],[33,2,34,2],[33,3,34,3],[39,2,52,2],[39,3,52,3],[53,2,56,2],[53,3,56,3],[86,3,87,3],[10,11,11,11],[12,1,63,1],[14,2,15,2],[14,3,15,3],[16,2,17,2],[16,3,17,3],[18,2,19,2],[18,3,19,3],[28,2,29,2],[59,2,61,2],[59,3,61,3],[62,2,63,2],[62,3,63,3],[118,2,121,2],[64,1,87,1],[77,2,78,2],[77,3,78,3],[84,2,85,2],[84,3,85,3],[86,2,87,2],[118,3,121,3],[122,2,123,2],[122,3,123,3],[88,1,107,1],[90,2,91,2],[90,3,91,3],[93,2,100,2],[93,3,100,3],[102,2,106,2],[102,3,106,3],[108,1,126,1],[109,2,113,2],[109,3,113,3],[114,2,115,2],[114,3,115,3],[116,2,117,2],[116,3,117,3]]}
[null,"DÉPARTEMENT D’ÉVALUATION DES FORMATIONS"]
[]
[]
[]
[]
[null,{"$f":"IF('1. Présentation'!D11<>\"\",'1. Présentation'!D11,\"\")","v":""}]
[]
[null,"3. Données",null,"*Pour une définition des niveaux de la grille d'auto-positionnement, voir le tableau à droite"]
[null,"Cet onglet permet de présenter l'auto-positionnement (colonne D) et les données quantitatives (colonnes E à K), qui étayent l'analyse de chaque critère ou référence du référentiel d'évaluation d'une formation du 3e cycle, menée par la formation doctorale dans le cadre de son autoévaluation. Pour chaque donnée quantitative, indiquer une valeur caractérisant la formation doctorale pour chacune des années de référence (colonnes F à K).\nLorsque la donnée est invariante dans la période de référence, indiquer la valeur correspondant à 2023-2024 (les autres cellules sont grisées). \n"]
[]
[null,null,"Référentiel d'évaluation des formations du 3e cycle","Auto-positionnement\n\nNiveau atteint : \n1, 2, 3, 4, 5 *","Code de la donnée","Données quantitatives","Valeurs pour chaque année de la période de référence",null,null,null,null,"Précisions sur la définition et/ou le mode de calcul de la donnée \n(en particulier, lorsque les éléments présents dans le SI de l'établissement ou de tous les établissements co-accrédités ne correspondent pas aux éléments indiqués par le Hcéres)\n(500 caractères maximum)"]
[null,null,null,null,null,null,"Année 2019-2020","Année 2020-2021","Année 2021-2022","Année 2022-2023","Année 2023-2024"]
[null,"Domaine 1 : \nLa politique de la formation doctorale menée dans le périmètre de l’école doctorale","Référence 1 : La formation doctorale** élaborée et mise en œuvre dans le périmètre de l’école doctorale est cohérente avec le positionnement et la stratégie de l’établissement."]
[null,null,"C1. Le périmètre de l’école doctorale couvre un ou plusieurs domaines scientifiques déclinés chacun en une ou plusieurs spécialités de doctorat et adossés aux axes scientifiques d'unités de recherche de qualité et reconnues, qui lui sont rattachées."]
[null,null,"C2. La formation doctorale mise en œuvre dans ce périmètre définit ses objectifs et ses débouchés en cohérence avec les ambitions, les orientations scientifiques et les priorités thématiques de l’établissement.",null,"DQT 1-2a","Nombre total de thèses s'inscrivant dans le cadre des priorités thématiques de l’établissement ou, le cas échéant, de tous les établissements co-accrédités."]
{"$rows_left_out":113}
{"sheet":"Nomenclature","index":4,"n_rows":64,"n_cols":54,"rows_kept":64,"cut":false,"hidden":true,"merged":[]}
["Établissements","Codes UAI",null,"Université Toulouse Capitole","Université Savoie Mont Blanc","Université Lumière Lyon-II","Université Jean Moulin Lyon-III","Université Jean Monnet Saint-Étienne","Université Grenoble Alpes","Université de Toulouse","Université de Perpignan Via-Domitia","Université de Montpellier Paul-Valéry","Université de Montpellier","Université Clermont Auvergne","Université Claude Bernard Lyon-I","Nîmes Université","Institut national des sciences appliquées de Lyon","École normale supérieure de Lyon","École centrale de Lyon","Libellé établissement","Intitulé indiqué dans l'arrê\u0090té d'accréditation","Code UAI Etablissement","Type de formation indiqué dans l'arrê\u0090té d'accréditation","Numéro d'accréditation de la mention","Domaine indiqué dans l'arrê\u0090té d'accréditation","Composante de rattachement",null,null,null,null,null,null,null,null,null,null,null,null,null,null,null,null,null,null,null,null,null,null,null,null,null,null,"Domaines disciplinaires","Codes domaines disciplinaires"]
["École centrale de Lyon","0690187D",2,"Droit et science politique","Chimie et sciences du vivant (CSV)","Éducation, psychologie, information et communication (EPIC)","École doctorale de Droit","Sciences ingénierie santé (SIS)","Chimie et sciences du vivant (CSV)","Arts, lettres, langues, philosophie, communication (ALLPH@)","Énergie et environnement","Langues, littératures, cultures, civilisations","Droit et science politique","Lettres, langues, sciences humaines et sociales","École doctorale de chimie de Lyon (CHIMIE)","Risques et société","Électronique, électrotechnique, automatique (EEA)","Biologie moléculaire, intégrative et cellulaire (BMIC)","École doctorale Matériaux de Lyon (EDML)","Université Toulouse Capitole","Droit et science politique","0313124C",null,479,"Sciences de la société",null,null,null,null,null,null,null,null,null,null,null,null,null,null,null,null,null,null,null,null,null,null,null,null,null,null,null,"Mathématiques et leurs interactions"]
["École normale supérieure de Lyon","0694123G",1,"Sciences de gestion - Toulouse Sciences du Management (TSM)","Sciences, ingénierie, environnement (SIE)","Lettres, langues, linguistique et arts (3LA)","Philosophie",null,"École doctorale de physique de Grenoble","Biologie -  santé - biotechnologies","Intermed : espaces, temps, cultures","Territoires, temps, sociétés et développement","Économie et gestion (EDEG)","Sciences de la vie, santé, agronomie, environnement","École doctorale Informatique, mathématiques de Lyon (InfoMaths)",null,"Mécanique, énergétique, génie civil, acoustique (MEGA)",null,"Mécanique, énergétique, génie civil, acoustique (MEGA)","Université Toulouse Capitole","Sciences de gestion - Toulouse Sciences du Management (TSM)","0313124C",null,478,"Sciences de la société",null,null,null,null,null,null,null,null,null,null,null,null,null,null,null,null,null,null,null,null,null,null,null,null,null,null,null,"Physique"]
["Institut national des sciences appliquées de Lyon","0690192J",2,"Toulouse sciences économiques","Droit, économie, management (DEM)","Sciences sociales (histoire, géographie, aménagement, urbanisme, archéologie, science politique, sociologie, anthropologie)","Sciences économiques et de gestion (SEG)","Sciences économiques et de gestion (SEG)","Électronique, électrotechnique, automatique, traitement du signal (EEATS)","Comportement, langage, éducation, socialisation, cognition","Comportement, langage, éducation, socialisation, cognition","Organisations, marchés, institutions","Gaia - biodiversité, agriculture, alimentation, environnement, terre, eau","Sciences économiques, juridiques, politiques et de gestion","École doctorale interdisciplinaire Sciences santé (EDISS)","École doctorale interdisciplinaire Sciences santé (EDISS)",null,null,null,"Université Toulouse Capitole","Toulouse sciences économiques","0313124C",null,171,"Sciences de la société",null,null,null,null,null,null,null,null,null,null,null,null,null,null,null,null,null,null,null,null,null,null,null,null,null,null,null,"Sciences de la terre et de l'univers, espace"]
["Nîmes Université","0301687W",1,null,"Electrical, Optical, Bio-physics and Engineering (EOBE)",null,"Sciences sociales",null,"Ingénierie - matériaux, mécanique, environnement, énergétique, procédés, production (I-MEP2)","Génie électrique, électronique, télécommunications et santé","Génie électrique, électronique, télécommunications et santé","Sciences de la vie et de la santé","Information, structures et systèmes (I2S)","Sciences fondamentales","Évolution, écosystèmes, microbiologie,  modélisation (E2M2)","Évolution, écosystèmes, microbiologie,  modélisation (E2M2)",null,null,null,"Université Savoie Mont Blanc","Chimie et sciences du vivant (CSV)","0730858L",null,633,"Sciences humaines et humanités nouvelles ; Sciences et technologies de l'information et de la communication ; Sciences de la société",null,null,null,null,null,null,null,null,null,null,null,null,null,null,null,null,null,null,null,null,null,null,null,null,null,null,null,"Chimie"]
["Université Claude Bernard Lyon-I","0691774D",7,null,"Innovation thérapeutique : du fondamental à l'appliqué (ITFA)",null,4,null,"Ingénierie pour la santé, la cognition, l'environnement (ISCE)","Mathématiques, informatique, télécommunications de Toulouse","Mathématiques, informatique, télécommunications de Toulouse","Sciences, ingénierie et environnement","Sciences chimiques Balard","Sciences pour l'ingénieur","Neurosciences et cognition (NSCO)","Neurosciences et cognition (NSCO)",null,null,null,"Université Savoie Mont Blanc","Sciences, ingénierie, environnement (SIE)","0730858L",null,634,"Biologie, médecine, santé ; Sciences agronomiques et écologiques ; Chimie ; Sciences pour l'ingénieur",null,null,null,null,null,null,null,null,null,null,null,null,null,null,null,null,null,null,null,null,null,null,null,null,null,null,null,"Biologie , médecine, santé"]
["Université Clermont Auvergne","0632084Y",5,null,"Interfaces",null,null,null,"Langues, littératures et sciences humaines (LLSH)","Mécanique, énergétique, génie civil, procédés","Mécanique, énergétique, génie civil, procédés","Ville, transports et territoires","Sciences chimiques et biologiques pour la santé (CBS2)","Sciences chimiques et biologiques pour la santé (CBS2)","Physique et astrophysique (PHAST)","Physique et astrophysique (PHAST)",null,null,null,"Université Lumière Lyon-II","Éducation, psychologie, information et communication (EPIC)","0691775E",null,485,"Sciences humaines et humanités nouvelles ; Sciences de la société",null,null,null,null,null,null,null,null,null,null,null,null,null,null,null,null,null,null,null,null,null,null,null,null,null,null,null,"Sciences humaines et humanités"]
["Université de Montpellier","0342490X",6,null,"Mathématiques Hadamard (EDMH)",null,null,null,"Mathématiques, sciences et technologies de l'information, informatique (MSTII)","Sciences de la matière","Sciences de la matière",6,null,null,"Sciences économiques et de gestion (SEG)","Sciences économiques et de gestion (SEG)",null,null,null,"Université Lumière Lyon-II","Lettres, langues, linguistique et arts (3LA)","0691775E",null,484,"Sciences humaines et humanités nouvelles",null,null,null,null,null,null,null,null,null,null,null,null,null,null,null,null,null,null,null,null,null,null,null,null,null,null,null,"Sciences de la société"]
["Université de Montpellier Paul-Valéry","0341089Z",2,null,"Ondes et matières (EDOM)",null,null,null,"Sciences de gestion (SG)","Sciences de l'univers, de l'environnement et de l'espace ","Sciences de l'univers, de l'environnement et de l'espace ",null,null,null,null,null,null,null,null,"Université Lumière Lyon-II","Sciences sociales (histoire, géographie, aménagement, urbanisme, archéologie, science politique, sociologie, anthropologie)","0691775E",null,483,"Sciences humaines et humanités nouvelles ; Sciences de la société",null,null,null,null,null,null,null,null,null,null,null,null,null,null,null,null,null,null,null,null,null,null,null,null,null,null,null,"Sciences pour l'ingénieur"]
["Université de Perpignan Via-Domitia","0660437S",2,null,"Particules hadrons énergie et noyau : instrumentation, image, cosmos et simulation (PHENICS)",null,null,null,"Sciences de la terre, de l'environnement et des planètes (STEP)","Sciences écologiques, vétérinaires, agronomiques et bioingénieries","Sciences écologiques, vétérinaires, agronomiques et bioingénieries",null,null,null,null,null,null,null,null,"Université Jean Moulin Lyon-III","École doctorale de Droit","0692437Z",null,492,"Sciences de la société",null,null,null,null,null,null,null,null,null,null,null,null,null,null,null,null,null,null,null,null,null,null,null,null,null,null,null,"Sciences et technologies de l'information et de la communication"]
["Université de Toulouse","0312758E",11,null,"Santé publique",null,null,null,"Sciences de l'homme, du politique et du territoire (SHPT)","Systèmes","Systèmes",null,null,null,null,null,null,null,null,"Université Jean Moulin Lyon-III","Philosophie","0692437Z",null,487,"Sciences humaines et humanités nouvelles",null,null,null,null,null,null,null,null,null,null,null,null,null,null,null,null,null,null,null,null,null,null,null,null,null,null,null,"Sciences agronomiques et écologiques"]
["Université Grenoble Alpes","0383546Y",12,null,"Sciences chimiques : molécules, matériaux, instrumentation et biosystèmes (2MIB)",null,null,null,"Sciences économiques (SE)","Temps, espaces, sociétés, cultures (TESC)","Temps, espaces, sociétés, cultures (TESC)",null,null,null,null,null,null,null,null,"Université Jean Moulin Lyon-III","Sciences économiques et de gestion (SEG)","0692437Z",null,486,"Sciences de la société"]
["Université Jean Monnet Saint-Étienne","0421095M",1,null,"Sciences du sport, de la motricité et du mouvement humain",null,null,null,"Sciences juridiques (SJ)","Sciences juridiques (SJ)",null,null,null,null,null,null,null,null,null,"Université Jean Monnet Saint-Étienne","Sciences ingénierie santé (SIS)","0421095M",null,488]
["Université Jean Moulin Lyon-III","0692437Z",3,null,"Sciences du végétal : du gène à l'écosystème (SEVE)",null,null,null,null,null,null,null,null,null,null,null,null,null,null,"Université Grenoble Alpes","Chimie et sciences du vivant (CSV)","0383546Y",null,218,"Chimie"]
["Université Lumière Lyon-II","0691775E",3,null,"Sciences et technologies de l'information et de la communication (STIC)",null,null,null,null,null,null,null,null,null,null,null,null,null,null,"Université Grenoble Alpes","École doctorale de physique de Grenoble","0383546Y",null,47,"Physique"]
{"$rows_left_out":50}
{"sheet":"Dev","index":5,"n_rows":0,"n_cols":0,"rows_kept":0,"cut":false,"hidden":true,"merged":[]}

{"sheet":"Data des listes","index":6,"n_rows":66,"n_cols":2,"rows_kept":66,"cut":false,"hidden":true,"merged":[]}
["Référence 1 : La formation doctorale élaborée et mise en œuvre dans le périmètre de l’école doctorale est cohérente avec le positionnement et la stratégie de l’établissement.","Choix d'auto-positionnement"]
["C1. Le périmètre de l’école doctorale couvre un ou plusieurs domaines scientifiques déclinés chacun en une ou plusieurs spécialités de doctorat et adossés aux axes scientifiques des unités de recherche qui lui sont rattachées.",1]
["C2. La formation doctorale mise en œuvre dans ce périmètre s’inscrit dans les ambitions, dans les orientations scientifiques et dans les priorités thématiques de l’établissement.",2]
["C3. La formation doctorale est construite en articulation avec les formations du 2e cycle et, le cas échéant, avec celles du 3e cycle des formations de santé. Elle s’inscrit, le cas échéant, dans un programme de formation et de recherche qui intègre de façon coordonnée masters, formation(s) doctorale(s) et unités de recherche.",3]
["C4. La formation doctorale intègre l’apport de la pluridisciplinarité et de l’interdisciplinarité dans sa finalité et dans son contenu.",4]
["C5. La formation doctorale intègre les enjeux du développement durable, qui irriguent la posture et les travaux de recherche des doctorants.",5]
["C6. Avec la contribution de ses partenaires, la formation doctorale inclut des animations et des manifestations scientifiques, professionnalisantes et de médiation scientifique."]
["C7. La formation doctorale s’appuie sur les actions menées et les moyens obtenus dans le cadre des projets du Programme d'investissements d'avenir (PIA), pour dynamiser son contenu et ses dispositifs."]
["Référence 2 : La structuration de la formation doctorale est cohérente avec l’organisation de l’établissement et représente une valeur ajoutée pour ses partenariats."]
["C1. L’école assure, dans son périmètre, la mise en oeuvre de la formation doctorale. Elle se coordonne dans cette mission avec les unités de recherche qui lui sont rattachées, avec les autres écoles doctorales, avec les composantes et, le cas échéant, avec le collège doctoral de l'établissement. "]
["C2. L’école s’assure de la réalité et de la valeur ajoutée de ses partenariats académiques, en particulier dans le cas d’une co-accréditation portée par une coordination territoriale ou par les établissements du site. Le cas échéant, l’école doctorale précise l’articulation de ses missions avec celles du collège doctoral du site."]
["Référence 3 : La formation doctorale inclut une formation à et par la recherche, qui contribue à l’élaboration des travaux de recherche des doctorants."]
["C1. L’offre de formation doctorale est construite en cohérence avec le périmètre scientifique de l’école doctorale et intègre une formation aux différentes compétences nécessaires à l’élaboration du projet de recherche des doctorants. "]
["C2. Les enseignants-chercheurs et les chercheurs associés à l’école doctorale participent à la formation doctorale. "]
["C3. La formation à la recherche inclut une formation à l'éthique de la recherche, à l’intégrité scientifique et à la déontologie qui irrigue la posture et les travaux de recherche des doctorants."]
{"$rows_left_out":51}