{"text_format":"1","workbook":"xlsx","n_sheets":7,"sheets":["Notice technique","1. Présentation","2. Données de caractérisation","3. Données","Nomenclature","Dev","Data des listes"],"not_rendered":{"charts":0,"images":3,"macros":1,"external_links":0,"defined_names":31,"comments":0,"pivot_tables":0},"unopened":[],"bounds":{"document_bytes":16777216,"sheet_cells":100000,"rows_first":2000,"rows_last":500,"rows_between":2000,"halvings":0,"cell_chars":16384,"cell_head_chars":4096},"cells_cut":0,"cells_raw":0,"read":"whole","date_system":"1900"}

{"sheet":"Notice technique","index":0,"n_rows":39,"n_cols":13,"rows_kept":39,"cut":false,"hidden":false,"merged":[[0,2,3,12],[8,1,8,20],[18,2,18,20],[34,1,34,20]]}
[null,null,"DÉPARTEMENT D’ÉVALUATION DES FORMATIONS"]
["DEF 3e cycle","V 1.00"]
[]
[]
[]
[null,"Note d'utilisation"]
[]
[null,"Pourquoi ce tableau de données ?"]
[null,"Ce tableau a pour finalité la collecte de données quantitatives et d'auto-positionnement d'une formation doctorale. Il forme partie, avec le rapport d'autoévaluation, du dossier d'autoévaluation d'une formation du troisième cycle en vue de son évaluation par le Hcéres en vague E."]
[]
[null,"Comment le remplir ?"]
[null,"Le mode d'emploi pratique est le suivant."]
[]
[null,"1. Activer le contenu à l'ouverture du fichier"]
[null,null,"À l'ouverture du fichier, il est indispensable d'accepter l'activation des macros (ou des contenus) lorsque le tableur vous y invite, sans quoi le fichier ne pourra pas fonctionner correctement."]
[]
[null,"2. Renseigner d'abord les informations de l'onglet \"Présentation\""]
[null,null,"En premier lieu, choisir l'établissement concerné et l'école doctorale dans le périmètre de laquelle la formation doctorale est mise en œuvre."]
[null,null,"Indiquer ensuite le nombre de domaines scientifiques principaux de l'école doctorale. Ceci génèrera les lignes de saisie relatives aux données déclinées pour chaque domaine scientifique dans l'ensemble des onglets, lesquelles sont repérées par un astérisque."]
[null,null,"Il ne faut pas intervenir sur le fichier pendant le processus de génération de lignes. Ce processus peut prendre quelques instants."]
{"$rows_left_out":20}
{"sheet":"1. Présentation","index":1,"n_rows":903,"n_cols":6,"rows_kept":903,"cut":false,"hidden":false,"merged":[[0,1,3,4],[5,1,5,4]]}
[null,"DÉPARTEMENT D’ÉVALUATION DES FORMATIONS"]
[]
[]
[]
[]
[null,"1. Présentation de l'école doctorale"]
[]
["Code de la donnée"]
["P1","CI1","Établissement déposant",null,null,"Sélectionnez un établissement dans la liste déroulante."]
["P2","CI2","Code UAI",{"$f":"IF(ISERROR(VLOOKUP($D$9,Nomenclature!$A$2:$B$12,2,FALSE)),\"\",VLOOKUP($D$9,Nomenclature!$A$2:$B$12,2,FALSE))","v":""}]
["P3","CI4","Intitulé de l'école doctorale (ED)",null,null,"Sélectionnez l'intitulé de l'école doctorale dans la liste déroulante. \nCet intitulé correspond à la liste envoyée par l'établissement au Hcéres le 21/07/2023."]
["P4","CI5","Numéro de l'ED",{"$f":"IF(ISERROR(INDEX(Nomenclature!$X$2:$X$500,MATCH(1,(Nomenclature!$T$2:$T$500=$D$9)*(Nomenclature!$U$2:$U$500=$D$11),0))),\"\",(INDEX(Nomenclature!$X$2:$X$500,MATCH(1,(Nomenclature!$T$2:$T$500=$D$9)*(Nomenclature!$U$2:$U$500=$D$11),0))))","v":0}]
["P5",null,"Établissements co-accrédités"]
["P6",null,"Lieu(x) de formation"]
["P7",null,"Nombre de domaines scientifiques principaux",null,null,"Indiquer le nombre de domaines scientifiques principaux. S'il est supérieur ou égal à 2, ceci engendrera une création de lignes qui seront ajoutées automatiquement pour les données déclinées par domaine, lesquelles sont marquées par un astérique. Cette opération peut prendre quelques instants voire plus, notamment lorsque le nombre de domaines est important.\nSi vous modifiez le nombre de domaines disciplinaires en augmentant la valeur déjà saisie, des lignes supplémentaires seront ajoutées dans l’ensemble des onglets. En revanche, il n’est pas possible de modifier à la baisse le nombre de domaines pour éviter toute perte d’informations dans le DAE ; il vous faudra dans ce cas recommencer la saisie du fichier.\n"]
["P8",null,"Intitulé des domaines scientifiques principaux"]
[]
[]
[]
[null,null,"étab","formation_nom"]
{"$rows_left_out":884}
{"sheet":"2. Données de caractérisation","index":2,"n_rows":25,"n_cols":9,"rows_kept":25,"cut":false,"hidden":false,"merged":[[9,1,9,2],[7,4,7,9],[0,1,3,2],[7,1,7,2],[5,1,5,2]]}
[null,"DÉPARTEMENT D’ÉVALUATION DES FORMATIONS"]
[]
[]
[]
[]
[null,{"$f":"'1. Présentation'!D11","v":0}]
[]
[null,"2. Données de caractérisation de l'école doctorale"]
[]
[null,"Données de caractérisation",null,"Année 2018-2019","Année 2019-2020","Année 2020-2021","Année 2021-2022","Année 2022-2023","Précisions sur la définition et/ou le mode de calcul de la donnée (en particulier, lorsque les éléments présents dans le SI de l'établissement ne correspondent pas aux éléments indiqués par le Hcéres)"]
[null,"DC 1a","Nombre total d’inscrits hommes en doctorat"]
[null,"DC 1b","Nombre total d’inscrites femmes en doctorat "]
[null,"DC 2a","Nombre de doctorants inscrits en 1re année de thèse"]
[null,"DC 2b","Nombre de doctorants inscrits en 2e année de thèse"]
[null,"DC 2c","Nombre de doctorants inscrits en 3e année de thèse"]
[null,"DC 2d","Nombre de doctorants inscrits en 4e année de thèse"]
[null,"DC 2e","Nombre de doctorants inscrits en 5e année de thèse et au-delà "]
[null,"DC 3","Nombre de doctorants par domaine scientifique principal*"]
[null,"DC 4a","Nombre total de directeurs de thèses associés à l'école doctorale (personnes habilitées à diriger des recherches) "]
[null,"DC 4b","dont nombre total de directeurs de thèse associés à l'école doctorale et actifs (dirigeant une thèse ou plus)"]
{"$rows_left_out":6}
{"sheet":"3. Données","index":3,"n_rows":127,"n_cols":12,"rows_kept":127,"cut":false,"hidden":false,"merged":[[7,3,8,3],[8,1,8,2],[0,1,3,2],[5,1,5,2],[88,1,107,1],[90,2,91,2],[93,2,100,2],[102,2,106,2],[59,2,61,2],[62,2,63,2],[64,1,87,1],[77,2,78,2],[84,2,85,2],[86,2,87,2],[12,1,63,1],[14,2,15,2],[7,1,7,2],[16,2,17,2],[108,1,126,1],[109,2,113,2],[114,2,115,2],[116,2,117,2],[118,2,121,2],[122,2,123,2],[10,11,11,11],[39,2,52,2],[53,2,56,2],[10,2,11,2],[10,4,11,4],[10,5,11,5],[10,6,10,10],[18,2,19,2],[28,2,29,2],[33,2,34,2],[10,3,11,3],[14,3,15,3],[16,3,17,3],[18,3,19,3],[28,3,29,3],[33,3,34,3],[39,3,52,3],[53,3,56,3],[59,3,61,3],[62,3,63,3],[77,3,78,3],[84,3,85,3],[86,3,87,3],[90,3,91,3],[93,3,100,3],[122,3,123,3],[102,3,106,3],[109,3,113,3],[114,3,115,3],[116,3,117,3],[118,3,121,3]]}
[null,"DÉPARTEMENT D’ÉVALUATION DES FORMATIONS"]
[]
[]
[]
[]
[null,{"$f":"'1. Présentation'!D11","v":0}]
[]
[null,"3. Données",null,"*Pour une définition des niveaux de la grille d'auto-positionnement, voir le tableau à droite"]
[null,"Pour chacun des critères d'autoévaluation ci-dessous, indiquer une valeur caractérisant la formation doctorale pour chacune des années de référence.\nSi la donnée est invariante dans la période de référence, indiquer la valeur correspondant à 2022-2023."]
[]
[null,null,"Référentiel d'évaluation des Formations du 3e cycle","Auto-positionnement\n\nNiveau atteint : \n1, 2, 3, 4, 5 *","Code de la donnée","Données quantitatives","Valeurs pour chaque année de la période de référence",null,null,null,null,"Précisions sur la définition et/ou le mode de calcul de la donnée (en particulier, lorsque les éléments présents dans le SI de l'établissement ne correspondent pas aux éléments indiqués par le Hcéres)"]
[null,null,null,null,null,null,"Année 2018-2019","Année 2019-2020","Année 2020-2021","Année 2021-2022","Année 2022-2023"]
[null,"Domaine 1 : La politique de la formation doctorale menée dans le périmètre de l’école doctorale","Référence 1 : La formation doctorale élaborée et mise en œuvre dans le périmètre de l’école doctorale est cohérente avec le positionnement et la stratégie de l’établissement."]
[null,null,"C1. Le périmètre de l’école doctorale couvre un ou plusieurs domaines scientifiques déclinés chacun en une ou plusieurs spécialités de doctorat et adossés aux axes scientifiques des unités de recherche qui lui sont rattachées."]
[null,null,"C2. La formation doctorale mise en œuvre dans ce périmètre s’inscrit dans les ambitions, dans les orientations scientifiques et dans les priorités thématiques de l’établissement.",null,"DQT 1-2a","Nombre total de thèses s'inscrivant dans le cadre des priorités thématiques de l’établissement."]
[null,null,null,null,"DQT 1-2b","Nombre de thèses financées sur contrat doctoral (tous types confondus) s’inscrivant dans le cadre des priorités thématiques de l’établissement."]
[null,null,"C3. La formation doctorale est construite en articulation avec les formations du 2e cycle et, le cas échéant, avec celles du 3e cycle des formations de santé. Elle s’inscrit, le cas échéant, dans un programme de formation et de recherche qui intègre de façon coordonnée masters, formation(s) doctorale(s) et unités de recherche.",null,"DQT 1-3a","Nombre d’étudiants de 2e année du 2e cycle des établissements associés à l’ED inscrits en doctorat en année n+1 et n+2."]
[null,null,null,null,"DQT 1-3b","Nombre d'étudiants de 2e année du 2e cycle inscrits en doctorat en année n+1 et relevant d'un programme de formation et de recherche qui intègre de façon coordonnée masters, formation(s) doctorale(s) et unités de recherche."]
[null,null,"C4. La formation doctorale intègre l’apport de la pluridisciplinarité et de l’interdisciplinarité dans sa finalité et dans son contenu.",null,"DQT 1-4a","Nombre de sujets de thèses interdisciplinaires."]
[null,null,null,null,"DQT 1-4b","Nombre de sujets de thèses interdisciplinaires financés sur contrat doctoral (tous types confondus)."]
{"$rows_left_out":108}
{"sheet":"Nomenclature","index":4,"n_rows":52,"n_cols":54,"rows_kept":52,"cut":false,"hidden":true,"merged":[]}
["Établissements","Codes UAI",null,"Université Polytechnique Hauts-de-France","Université Paris Saclay","Université Paris Nanterre","Université Paris 8 - Vincennes - Saint-Denis","Université de technologie de Compiègne","Université de Picardie Jules Verne","Université de Lille","Université de La Réunion","Paris-Est Sup","Institut Polytechnique de Paris","CY Cergy Paris Université","École des hautes études en sciences sociales",null,null,null,null,"Libellé établissement","Intitulé indiqué dans l'arrê\u0090té d'accréditation","Code UAI Etablissement","Type de formation indiqué dans l'arrê\u0090té d'accréditation","Numéro d'accréditation de la mention","Domaine indiqué dans l'arrê\u0090té d'accréditation","Composante de rattachement",null,null,null,null,null,null,null,null,null,null,null,null,null,null,null,null,null,null,null,null,null,null,null,null,null,null,"Domaines disciplinaires","Codes domaines disciplinaires"]
["Université Polytechnique Hauts-de-France","0597132G",1,"École doctorale polytechnique Hauts-de-France ","Agriculture, alimentation, biologie, environnement, santé (ABIES)","Connaissance, langage, modélisation","Cognition, langage, interaction","Sciences pour l'ingénieur","Sciences humaines et sociales","Biologie-santé (BSL)","École doctorale Sciences humaines et sociales","Mathématiques et sciences et technologies de l'information et de la communication","École doctorale de l'Institut Polytechnique de Paris (ED IP Paris)","Droit et science politique (DSP)",null,null,null,null,null,"Université Polytechnique Hauts-de-France","École doctorale polytechnique Hauts-de-France ","0597132G",null,635,"Mathématiques et leurs interactions ; Chimie ; Biologie, médecine, santé ; Sciences humaines et humanités nouvelles ; Sciences de la société ; Sciences pour l'ingénieur ; Sciences et technologies de l'information et de la communication",null,null,null,null,null,null,null,null,null,null,null,null,null,null,null,null,null,null,null,null,null,null,null,null,null,null,null,"Mathématiques et leurs interactions"]
["Université Paris Saclay","0912408Y",18,1,"Cancérologie : biologie - médecine - santé (CBMS)","Droit et science politique","Esthétique, sciences et technologies des arts",1,"Sciences, technologie et santé","Mathématiques, sciences du numérique et de leurs interactions (MADIS)","École doctorale Sciences, technologies et santé","Organisations, marchés, institutions",1,"Économie, management, mathématiques, physique et sciences informatiques (EM2PSI)",null,null,null,null,null,"Université Paris Saclay","Agriculture, alimentation, biologie, environnement, santé (ABIES)","0912408Y",null,581,"Mathématiques et leurs interactions ; Biologie, médecine, santé ; Sciences humaines et humanités nouvelles ; Sciences de la société ; Sciences pour l'ingénieur ; Sciences agronomiques et écologiques",null,null,null,null,null,null,null,null,null,null,null,null,null,null,null,null,null,null,null,null,null,null,null,null,null,null,null,"Physique"]
["Université Paris Nanterre","0921204J",5,null,"Droit, économie, management (DEM)","Économie, organisations, société","Pratiques et théories du sens",null,2,"Science de l'ingénierie et des systèmes (ENGSYS)",2,"Sciences de la vie et de la santé",null,"Éducation didactique cognition (EDC) ",null,null,null,null,null,"Université Paris Saclay","Cancérologie : biologie - médecine - santé (CBMS)","0912408Y",null,582,"Sciences humaines et humanités nouvelles ; Sciences de la société",null,null,null,null,null,null,null,null,null,null,null,null,null,null,null,null,null,null,null,null,null,null,null,null,null,null,null,"Sciences de la terre et de l'univers, espace"]
["Université Paris 8 - Vincennes - Saint-Denis","0931827F",4,null,"Electrical, Optical, Bio-physics and Engineering (EOBE)","Espaces, temps, cultures","Sciences sociales",null,null,"Sciences de la matière, du rayonnement et de l'environnement (SMRE)",null,"Sciences, ingénierie et environnement",null,"Humanité création patrimoine (HCP) ",null,null,null,null,null,"Université Paris Saclay","Droit, économie, management (DEM)","0912408Y",null,630,"Sciences humaines et humanités nouvelles ; Sciences de la société",null,null,null,null,null,null,null,null,null,null,null,null,null,null,null,null,null,null,null,null,null,null,null,null,null,null,null,"Chimie"]
["Université de technologie de Compiègne","0601223D",1,null,"Innovation thérapeutique : du fondamental à l'appliqué (ITFA)","Lettres, langues, spectacles",4,null,null,"Sciences de l'homme et de la société (SHS)",null,"Ville, transports et territoires",null,"Sciences et ingénierie (SI)",null,null,null,null,null,"Université Paris Saclay","Electrical, Optical, Bio-physics and Engineering (EOBE)","0912408Y",null,575,"Physique ; Chimie ; Sciences pour l'ingénieur ; Sciences et technologies de l'information et de la communication",null,null,null,null,null,null,null,null,null,null,null,null,null,null,null,null,null,null,null,null,null,null,null,null,null,null,null,"Biologie , médecine, santé"]
["Université de Picardie Jules Verne","0801344B",2,null,"Interfaces",5,null,null,null,"Sciences économiques, sociales, de l'aménagement et du management (SESAM)",null,5,null,5,null,null,null,null,null,"Université Paris Saclay","Innovation thérapeutique : du fondamental à l'appliqué (ITFA)","0912408Y",null,569,"Chimie ; Biologie, médecine, santé ; Sciences humaines et humanités nouvelles ; Sciences pour l'ingénieur",null,null,null,null,null,null,null,null,null,null,null,null,null,null,null,null,null,null,null,null,null,null,null,null,null,null,null,"Sciences humaines et humanités"]
["Université de Lille","0597239Y",7,null,"Mathématiques Hadamard (EDMH)",null,null,null,null,"Sciences juridiques, politiques et de gestion (SJPG) ",null,null,null,null,null,null,null,null,null,"Université Paris Saclay","Interfaces","0912408Y",null,573,"Mathématiques et leurs interactions ; Physique ; Chimie ; Biologie, médecine, santé ; Sciences pour l'ingénieur ; Sciences et technologies de l'information et de la communication",null,null,null,null,null,null,null,null,null,null,null,null,null,null,null,null,null,null,null,null,null,null,null,null,null,null,null,"Sciences de la société"]
["Université de La Réunion","9740478B",2,null,"Ondes et matières (EDOM)",null,null,null,null,7,null,null,null,null,null,null,null,null,null,"Université Paris Saclay","Mathématiques Hadamard (EDMH)","0912408Y",null,574,"Mathématiques et leurs interactions",null,null,null,null,null,null,null,null,null,null,null,null,null,null,null,null,null,null,null,null,null,null,null,null,null,null,null,"Sciences pour l'ingénieur"]
["Paris-Est Sup","0772710C",5,null,"Particules hadrons énergie et noyau : instrumentation, image, cosmos et simulation (PHENICS)",null,null,null,null,null,null,null,null,null,null,null,null,null,null,"Université Paris Saclay","Ondes et matières (EDOM)","0912408Y",null,572,"Physique",null,null,null,null,null,null,null,null,null,null,null,null,null,null,null,null,null,null,null,null,null,null,null,null,null,null,null,"Sciences et technologies de l'information et de la communication"]
["Institut Polytechnique de Paris","0952198Y",1,null,"Santé publique",null,null,null,null,null,null,null,null,null,null,null,null,null,null,"Université Paris Saclay","Particules hadrons énergie et noyau : instrumentation, image, cosmos et simulation (PHENICS)","0912408Y",null,576,"Physique ; Sciences pour l'ingénieur",null,null,null,null,null,null,null,null,null,null,null,null,null,null,null,null,null,null,null,null,null,null,null,null,null,null,null,"Sciences agronomiques et écologiques"]
["CY Cergy Paris Université","0952259P",5,null,"Sciences chimiques : molécules, matériaux, instrumentation et biosystèmes (2MIB)",null,null,null,null,null,null,null,null,null,null,null,null,null,null,"Université Paris Saclay","Santé publique","0912408Y",null,570,"Mathématiques et leurs interactions ; Biologie, médecine, santé ; Sciences humaines et humanités nouvelles ; Sciences de la société"]
[null,null,0,null,"Sciences du sport, de la motricité et du mouvement humain",null,null,null,null,null,null,null,null,null,null,null,null,null,null,"Université Paris Saclay","Sciences chimiques : molécules, matériaux, instrumentation et biosystèmes (2MIB)","0912408Y",null,571,"Physique ; Chimie"]
[null,null,null,null,"Sciences du végétal : du gène à l'écosystème (SEVE)",null,null,null,null,null,null,null,null,null,null,null,null,null,null,"Université Paris Saclay","Sciences du sport, de la motricité et du mouvement humain","0912408Y",null,566,"Biologie, médecine, santé ; Sciences humaines et humanités nouvelles"]
[null,null,null,null,"Sciences et technologies de l'information et de la communication (STIC)",null,null,null,null,null,null,null,null,null,null,null,null,null,null,"Université Paris Saclay","Sciences du végétal : du gène à l'écosystème (SEVE)","0912408Y",null,567,"Sciences agronomiques et écologiques"]
[null,null,null,null,"Sciences mécaniques et énergétiques, matériaux et géosciences (SMEMAG)",null,null,null,null,null,null,null,null,null,null,null,null,null,null,"Université Paris Saclay","Sciences et technologies de l'information et de la communication (STIC)","0912408Y",null,580,"Sciences et technologies de l'information et de la communication"]
[null,null,null,null,"Sciences sociales et humanités (SSH)",null,null,null,null,null,null,null,null,null,null,null,null,null,null,"Université Paris Saclay","Sciences mécaniques et énergétiques, matériaux et géosciences (SMEMAG)","0912408Y",null,579,"Sciences de la terre et de l'univers, espace ; Sciences pour l'ingénieur"]
[null,null,null,null,"Signalisations et réseaux intégratifs en biologie (Bio-signe)",null,null,null,null,null,null,null,null,null,null,null,null,null,null,"Université Paris Saclay","Sciences sociales et humanités (SSH)","0912408Y",null,629,"Sciences humaines et humanités nouvelles ; Sciences de la société"]
[null,null,null,null,"Structure et dynamique des systèmes vivants (SDSV)",null,null,null,null,null,null,null,null,null,null,null,null,null,null,"Université Paris Saclay","Signalisations et réseaux intégratifs en biologie (Bio-signe)","0912408Y",null,568,"Biologie, médecine, santé"]
[null,null,null,null,18,null,null,null,null,null,null,null,null,null,null,null,null,null,null,"Université Paris Saclay","Structure et dynamique des systèmes vivants (SDSV)","0912408Y",null,577,"Biologie, médecine, santé ; Sciences humaines et humanités nouvelles ; Sciences pour l'ingénieur ; Sciences agronomiques et écologiques"]
{"$rows_left_out":33}
{"sheet":"Dev","index":5,"n_rows":0,"n_cols":0,"rows_kept":0,"cut":false,"hidden":true,"merged":[]}

{"sheet":"Data des listes","index":6,"n_rows":66,"n_cols":2,"rows_kept":66,"cut":false,"hidden":true,"merged":[]}
["Référence 1 : La formation doctorale élaborée et mise en œuvre dans le périmètre de l’école doctorale est cohérente avec le positionnement et la stratégie de l’établissement.","Choix d'auto-positionnement"]
["C1. Le périmètre de l’école doctorale couvre un ou plusieurs domaines scientifiques déclinés chacun en une ou plusieurs spécialités de doctorat et adossés aux axes scientifiques des unités de recherche qui lui sont rattachées.",1]
["C2. La formation doctorale mise en œuvre dans ce périmètre s’inscrit dans les ambitions, dans les orientations scientifiques et dans les priorités thématiques de l’établissement.",2]
["C3. La formation doctorale est construite en articulation avec les formations du 2e cycle et, le cas échéant, avec celles du 3e cycle des formations de santé. Elle s’inscrit, le cas échéant, dans un programme de formation et de recherche qui intègre de façon coordonnée masters, formation(s) doctorale(s) et unités de recherche.",3]
["C4. La formation doctorale intègre l’apport de la pluridisciplinarité et de l’interdisciplinarité dans sa finalité et dans son contenu.",4]
["C5. La formation doctorale intègre les enjeux du développement durable, qui irriguent la posture et les travaux de recherche des doctorants.",5]
["C6. Avec la contribution de ses partenaires, la formation doctorale inclut des animations et des manifestations scientifiques, professionnalisantes et de médiation scientifique."]
["C7. La formation doctorale s’appuie sur les actions menées et les moyens obtenus dans le cadre des projets du Programme d'investissements d'avenir (PIA), pour dynamiser son contenu et ses dispositifs."]
["Référence 2 : La structuration de la formation doctorale est cohérente avec l’organisation de l’établissement et représente une valeur ajoutée pour ses partenariats."]
["C1. L’école assure, dans son périmètre, la mise en oeuvre de la formation doctorale. Elle se coordonne dans cette mission avec les unités de recherche qui lui sont rattachées, avec les autres écoles doctorales, avec les composantes et, le cas échéant, avec le collège doctoral de l'établissement. "]
["C2. L’école s’assure de la réalité et de la valeur ajoutée de ses partenariats académiques, en particulier dans le cas d’une co-accréditation portée par une coordination territoriale ou par les établissements du site. Le cas échéant, l’école doctorale précise l’articulation de ses missions avec celles du collège doctoral du site."]
["Référence 3 : La formation doctorale inclut une formation à et par la recherche, qui contribue à l’élaboration des travaux de recherche des doctorants."]
["C1. L’offre de formation doctorale est construite en cohérence avec le périmètre scientifique de l’école doctorale et intègre une formation aux différentes compétences nécessaires à l’élaboration du projet de recherche des doctorants. "]
["C2. Les enseignants-chercheurs et les chercheurs associés à l’école doctorale participent à la formation doctorale. "]
["C3. La formation à la recherche inclut une formation à l'éthique de la recherche, à l’intégrité scientifique et à la déontologie qui irrigue la posture et les travaux de recherche des doctorants."]
["C4. La formation par la recherche des doctorants s’appuie sur leur participation, pendant et après la thèse, aux activités et à la production scientifiques de leur unité de recherche de rattachement."]
["C5. La formation doctorale s’appuie sur les services de documentation notamment en matière d’accès aux ressources documentaires et de contribution aux contenus de formation."]
["C6. La formation doctorale s’inscrit dans une perspective de science ouverte dans le cadre de laquelle les modalités de dépôt des thèses et des travaux des doctorants et docteurs sont suivies et accompagnées."]
["Référence 4 : La formation doctorale s’appuie sur une politique de professionnalisation dans une perspective de valorisation du doctorat."]
["C1. La formation doctorale prend en compte les besoins sociaux, économiques et culturels du territoire pour définir ses objectifs et diversifier ses débouchés dans les différents secteurs, dont le secteur académique."]
{"$rows_left_out":46}