{"text_format":"1","workbook":"xlsx","n_sheets":7,"sheets":["Notice technique","1. Présentation","2. Données de caractérisation","3. Données et analyse","Data des listes","Nomenclature","Dev"],"not_rendered":{"charts":0,"images":2,"macros":1,"external_links":0,"defined_names":63,"comments":0,"pivot_tables":0},"unopened":[],"bounds":{"document_bytes":16777216,"sheet_cells":100000,"rows_first":2000,"rows_last":500,"rows_between":2000,"halvings":0,"cell_chars":16384,"cell_head_chars":4096},"cells_cut":0,"cells_raw":0,"read":"whole","date_system":"1900"}

{"sheet":"Notice technique","index":0,"n_rows":47,"n_cols":17,"rows_kept":47,"cut":false,"hidden":false,"merged":[[42,1,42,18],[0,2,3,12],[11,1,11,18],[12,1,12,18],[8,1,8,18],[19,2,19,18],[37,1,37,18],[41,1,41,18],[22,2,22,18],[23,2,23,18],[25,2,25,18],[24,2,24,18]]}
[null,null,"DÉPARTEMENT D’ÉVALUATION DES FORMATIONS"]
["DEF 2e cycle","V 1.00"]
[]
[]
[]
[null,"Note d'utilisation"]
[]
[null,"Pour quelles formations ?"]
[null,"Cette trame du dossier d'autoévaluation (DAE 21) est à compléter pour toutes les formations du deuxième cycle évaluées par le Hcéres, à l'exception des diplômes en cinq ans (ENS, IEP et orthophonie) qui font l'objet d'une trame spécifique (DAE 22), en vague E."]
[]
[null,"Pourquoi cette trame du dossier d'autoévaluation ?"]
[null,"Cette trame a pour finalité de collecter, dans un même fichier, toutes les analyses, étayées par des données et un auto-positionnement, constitutives du dossier d'autoévaluation d'une formation du 2e cycle en vue de son évaluation par le Hcéres en vague E."]
[null,"Les données attendues, pour appuyer l'analyse et l'auto-positionnement de chaque critère de chaque référence du référentiel d'évaluation des formations du 1er et du 2e cycle, sont de nature qualitative (données textuelles) ou quantitative (données chiffrées). Les données qualitatives sont à renseigner sous la forme d'un texte court ; les données quantitatives sont à renseigner sous forme brute (sauf indication contraire).                                                                                                                                                                                             "]
[]
[]
{"$rows_left_out":33}
{"sheet":"1. Présentation","index":1,"n_rows":906,"n_cols":6,"rows_kept":906,"cut":false,"hidden":false,"merged":[[0,1,3,4],[5,1,5,2]]}
[null,"DÉPARTEMENT D’ÉVALUATION DES FORMATIONS"]
[]
[]
[]
[]
[null,"1. Présentation de la formation"]
[]
["Code de la donnée",null,null,null,null," "]
["P1",null,"Établissement",null,null,"Sélectionner un établissement dans la liste déroulante."]
["P2",null,"Code UAI",{"$f":"IF(ISERROR(VLOOKUP($D$9,Nomenclature!$A$2:$B$22,2,FALSE)),\"\",VLOOKUP($D$9,Nomenclature!$A$2:$B$22,2,FALSE))","v":""}]
["P3",null,"Intitulé de la formation",null,null,"Sélectionner un intitulé de formation dans la liste déroulante. \nCet intitulé correspond à la liste transmise par l'établissement au Hcéres le 21 juillet 2023."]
["P4",null,"Type de cursus",{"$f":"IF(ISERROR(INDEX(Nomenclature!$AC$2:$AC$601,MATCH(1,(Nomenclature!$Z$2:$Z$601=$D$9)*(Nomenclature!$AA$2:$AA$601=$D$11),0))),\"\",(INDEX(Nomenclature!$AC$2:$AC$601,MATCH(1,(Nomenclature!$Z$2:$Z$601=$D$9)*(Nomenclature!$AA$2:$AA$601=$D$11),0))))","v":""}]
["P5",null,"Composante de rattachement",null,null,"Saisir le nom de la ou des composantes de rattachement (UFR, école, institut) si elle(s) existe(nt). Ne pas inclure le nom des structures internes (ex. département). Ne pas saisir d'autres types d'information (ex. données sur l'équipe pédagogique)."]
["P6",null,"Lieu(x) de formation (y compris des parcours diplômants délocalisés)"]
["P7",null,"Numéro d'accréditation",{"$f":"IF(ISERROR(INDEX(Nomenclature!$AD$2:$AD$601,MATCH(1,(Nomenclature!$Z$2:$Z$601=$D$9)*(Nomenclature!$AA$2:$AA$601=$D$11),0))),\"\",(INDEX(Nomenclature!$AD$2:$AD$601,MATCH(1,(Nomenclature!$Z$2:$Z$601=$D$9)*(Nomenclature!$AA$2:$AA$601=$D$11),0))))","v":""}]
{"$rows_left_out":892}
{"sheet":"2. Données de caractérisation","index":2,"n_rows":24,"n_cols":9,"rows_kept":24,"cut":false,"hidden":false,"merged":[[9,1,9,2],[6,5,6,9],[0,1,3,5],[7,1,7,2],[5,1,5,5]]}
[null,"DÉPARTEMENT D’ÉVALUATION DES FORMATIONS"]
[]
[]
[]
[]
[null,{"$f":"'1. Présentation'!D11","v":0}]
[]
[null,"2. Données de caractérisation de la formation"]
[]
[null,"Données de caractérisation",null,"Année 2020-2021","Année 2021-2022","Année 2022-2023","Précisions sur la définition et/ou le mode de calcul de la donnée (en particulier, lorsque les éléments présents dans le système d'information de l'établissement ne correspondent pas aux éléments indiqués par le Hcéres)"]
["IG1","DC 1","Nombre total d’inscrits administratifs dans la formation (dans tout le cycle)*",null,null,null,null,null,"IG1"]
[null,"DC 2","dont étudiants internationaux*"]
[null,"DC 3","dont étudiants ayant des besoins spécifiques et bénéficiant d'un aménagement d'études"]
["IG1","DC 4","Nombre total d’hommes inscrits dans la formation (inscrits administratifs dans tout le cycle)",null,null,null,null,null,"IG1"]
["IG1","DC 5","Nombre total de femmes inscrites dans la formation (inscrits administratifs dans tout le cycle)",null,null,null,null,null,"IG1"]
{"$rows_left_out":10}
{"sheet":"3. Données et analyse","index":3,"n_rows":112,"n_cols":13,"rows_kept":112,"cut":false,"hidden":false,"merged":[[100,11,101,11],[110,11,111,11],[35,11,36,11],[72,11,73,11],[76,11,77,11],[79,11,83,11],[85,11,96,11],[98,11,99,11],[41,11,45,11],[47,11,48,11],[49,11,51,11],[57,11,63,11],[66,11,71,11],[103,11,106,11],[10,12,11,12],[10,5,11,5],[10,11,11,11],[10,4,11,4],[12,1,45,1],[20,2,22,2],[23,2,24,2],[26,2,27,2],[28,2,30,2],[35,2,36,2],[28,10,30,10],[20,11,22,11],[23,11,24,11],[26,11,27,11],[28,11,30,11],[38,11,39,11],[97,1,111,1],[98,2,99,2],[100,2,101,2],[110,2,111,2],[74,1,96,1],[76,2,77,2],[103,2,106,2],[79,2,83,2],[85,2,96,2],[49,10,51,10],[1,3,4,9],[10,7,10,9],[0,1,3,2],[5,1,5,2],[7,1,7,2],[10,2,11,2],[10,6,11,6],[10,3,11,3],[8,1,8,4],[46,1,73,1],[57,2,63,2],[66,2,71,2],[72,2,73,2],[49,2,51,2],[41,2,45,2],[47,2,48,2],[37,2,39,2],[5,10,8,10],[5,11,8,11],[23,10,24,10],[20,10,22,10],[26,10,27,10],[35,10,36,10],[38,10,39,10],[41,10,45,10],[47,10,48,10],[10,10,11,10],[110,10,111,10],[85,10,96,10],[98,10,99,10],[100,10,101,10],[103,10,106,10],[57,10,63,10],[66,10,71,10],[72,10,73,10],[76,10,77,10],[79,10,83,10]]}
[null,"DÉPARTEMENT D’ÉVALUATION DES FORMATIONS"]
[]
[]
[]
[]
[null,{"$f":"'1. Présentation'!D11","v":0},null,null,null,null,null,null,null,null,"*Pour une définition des niveaux de la grille d'auto-positionnement, voir le tableau à droite","*Prise en compte des recommandations du Hcéres ; explication des résultats, des freins et des leviers ; explication des évolutions passées ou à venir ; mesures correctives proposées"]
[]
[null,"3. Données et analyse"]
[null,"Cet onglet permet de présenter l’autoévaluation de la formation, en s’appuyant sur une analyse et un auto-positionnement menés par l’équipe pédagogique pour chaque critère ou référence du référentiel d'évaluation des formations du 1er et du 2e cycle. Celles-ci sont étayées par des données qualitatives et des données quantitatives. \nPour chacune des données quantitatives ci-dessous, indiquer une valeur caractérisant la formation pour chacune des années de référence. \nSi la donnée est invariante dans la période de référence, indiquer la valeur correspondant à la colonne 2022-2023."]
[]
[null,null,"Référentiel d'évaluation des formations du 1er et du 2e cycle","Code de la donnée","Repères pour les données qualitatives","Données qualitatives (500 caractères maximum)","Données quantitatives","Valeur pour chaque année de la période de référence",null,null,"Auto-positionnement\n\nNiveau atteint :\n 1, 2, 3, 4, 5 *","Analyse obligatoire \nde l'auto-positionnement \net des données qualitatives \net quantitatives *\n\n(2 000 caractères maximum)","Précisions sur la définition et/ou le mode de calcul de la donnée (en particulier, lorsque les éléments présents dans le système d'information de l'établissement ne correspondent pas aux éléments indiqués par le Hcéres)"]
[null,null,null,null,null,null,null,"Année 2020-2021","Année 2021-2022","Année 2022-2023"]
[" pour initier aux enjeux de la transition écologique en cohérence avec des référentiels nationaux et européens ;","Domaine 1 : La politique et la caractérisation de la formation","Référence 1 : La formation est en adéquation avec la stratégie de formation de l’établissement."]
[null,null,"C1. La formation s’inscrit dans les ambitions, dans les orientations pédagogiques et dans les priorités thématiques de l’établissement.","Document 1","Critère évalué sur la base du document n°1 ayant valeur de preuve "]
[null,null,"C2. La formation est construite en cohérence et en complémentarité avec les autres formations du même cycle et en articulation avec celles des autres cycles avec lesquelles elle s’inscrit en continuum.","Document 1","Critère évalué sur la base du document n°1 ayant valeur de preuve "]
{"$rows_left_out":98}
{"sheet":"Data des listes","index":4,"n_rows":50,"n_cols":2,"rows_kept":50,"cut":false,"hidden":true,"merged":[]}
["Référence 1 : La formation est en adéquation avec la stratégie de formation de l’établissement.","Choix d'auto-positionnement"]
["C1. La formation s’inscrit dans les ambitions, les orientations pédagogiques et les priorités thématiques de l’établissement.",1]
["C2. La formation est construite en cohérence et complémentarité avec les autres formations du même cycle et en articulation avec celles des autres cycles avec lesquelles elle s’inscrit en continuum.",2]
["C3. La formation s’assure de la réalité et de la valeur ajoutée de ses partenariats académiques locaux, régionaux et nationaux.",3]
["C4. La formation intègre l’apport de la pluridisciplinarité et de l’interdisciplinarité dans sa finalité et dans son contenu.",4]
["C5. La formation intègre les enjeux du développement durable.",5]
["C6. La formation s’appuie sur les actions menées et sur les moyens obtenus dans le cadre des projets du Programme d'investissements d'avenir (PIA), pour dynamiser son contenu et ses dispositifs."]
["Référence 2 : La formation est ouverte à l’international en cohérence avec les priorités définies par l’établissement."]
["C1. La formation développe une offre spécifique à l'international en s’assurant de la réalité et de la valeur ajoutée de ses partenariats internationaux."]
["C2. La formation inclut des mobilités entrantes et sortantes des étudiants, et bénéficie, à cet effet, d'un soutien y compris financier."]
["Référence 3 : La formation bénéficie d’un adossement à la recherche."]
["C1. La formation intègre une formation à et par la recherche adaptée à sa finalité. "]
["C2. Des enseignants-chercheurs et chercheurs des disciplines de la formation participent aux enseignements."]
["C3. La formation et les unités de recherche auxquelles elle est adossée mettent en place, à l'intention des étudiants, un dispositif d’accueil, d’accompagnement et de formation par la recherche des étudiants."]
["C4. La formation inclut une formation à l’intégrité scientifique et à la déontologie."]
{"$rows_left_out":36}
{"sheet":"Nomenclature","index":5,"n_rows":601,"n_cols":32,"rows_kept":601,"cut":false,"hidden":true,"merged":[]}
["Établissements","Codes UAI",null,"Université Polytechnique Hauts-de-France","Université Paris Saclay","Université Paris Nanterre","Université Paris-Est Créteil","Université Paris 8 - Vincennes - Saint-Denis","Université du Littoral Côte d'Opale","Université d'Évry-Val-d'Essonne","Université de Versailles Saint-Quentin-En-Yvelines","Université de technologie de Compiègne","Université de Picardie Jules Verne","Université de Lille","Université de La Réunion","Université d'Artois","Institut Polytechnique de Paris","Institut national supérieur de formation et de recherche pour l'éducation des jeunes handicapés et les enseignements adaptés","Institut national de l'audiovisuel","École nationale supérieure du pétrole et des moteurs","École des Ponts ParisTech","CY Cergy Paris Université","Institut Mines-Télécom","Université Gustave Eiffel",null,"Libellé établissement","Intitulé indiqué dans l'arr\u0090té d'accréditation","Code UAI Etablissement","Type de formation indiqué dans l'arr\u0090té d'accréditation","Numéro d'accréditation de la mention","Domaine indiqué dans l'arr\u0090té d'accréditation","Composante de rattachement"]
["Université Polytechnique Hauts-de-France","0597132G",29,"Administration publique","Administration économique et sociale","Administration publique","Administration et échanges internationaux","Archives","Chimie","Chimie et sciences des matériaux","Chimie et sciences du vivant","Analyse et politique économique","Agrosciences, environnement, territoires, paysage, forêt","Administration économique et sociale","Anthropologie","Arts de la scène et du spectacle vivant","Biologie-santé","Pratiques inclusives, handicap, accessibilité et accompagnement ","Diplôme Gestion de patrimoines audiovisuels ","Diplôme d’études supérieures appliquées","Énergie","Biologie-santé","Management de l'innovation","Actuariat",null,"Université Polytechnique Hauts-de-France","Administration publique","0597132G","Master",20200141,"Droit, économie, gestion","Institut Sociétés et Humanités (ISH)"]
["Université Paris Saclay","0912408Y",64,"Arts","Agrosciences, environnement, territoires, paysage, forêt","Analyse et politique économique","Administration publique","Arts de la scène et du spectacle vivant","Didactique des langues","Comptabilité - contrôle - audit","Droit","Humanités et industries créatives","Arts de la scène et du spectacle vivant","Administration publique","Biodiversité, écologie et évolution","Droit de l'entreprise","Chimie",1,"Diplôme Production audiovisuelle",1,"Mathématiques et applications","Chimie",1,"Arts, lettres et civilisations",null,"Université Polytechnique Hauts-de-France","Arts","0597132G","Master",20200140,"Arts, lettres, langues","Institut Sociétés et Humanités (ISH)"]
["Université Paris Nanterre","0921204J",64,"Arts, lettres et civilisations","Archives","Anthropologie","Biologie-santé","Arts plastiques","Direction de projets ou établissements culturels","Justice, procès et procédures","Gestion de l'environnement","Ingénierie de la santé","Arts plastiques","Arts","Biologie-santé","Droit des collectivités territoriales","Économie",null,2,null,"Transport, mobilités, réseaux","Droit de la santé",null,"Comptabilité - contrôle - audit",null,"Université Polytechnique Hauts-de-France","Arts, lettres et civilisations","0597132G","Master",20200095,"Arts, lettres, langues","Institut Sociétés et Humanités (ISH)"]
["Université Paris-Est Créteil","0941111X",59,"Audiovisuel, médias interactifs numériques, jeux","Biodiversité, écologie et évolution","Archéologie, sciences pour l'archéologie","Chimie","Arts, technologies, création","Droit des affaires",3,"Management","Ingénierie des systèmes complexes","Biologie-santé","Automatique et systèmes électriques","Chimie et sciences du vivant","Droit public","Électronique, énergie électrique, automatique",null,null,null,3,"Droit des affaires",null,"Économie de l'entreprise et des marchés",null,"Université Polytechnique Hauts-de-France","Audiovisuel, médias interactifs numériques, jeux","0597132G","Master",20150565,"Sciences, technologies, santé","INSA"]
["Université Paris 8 - Vincennes - Saint-Denis","0931827F",40,"Comptabilité - contrôle - audit","Bio-informatique","Cinéma et audiovisuel","Communication publique et politique","Cinéma et audiovisuel","Droit des collectivités territoriales",null,"Management et administration des entreprises",4,"Chimie","Automatique, robotique","Comptabilité - contrôle - audit","Electronique, énergie électrique, automatique","Énergie",null,null,null,null,"Droit international",null,"Économie sociale et solidaire",null,"Université Polytechnique Hauts-de-France","Comptabilité - contrôle - audit","0597132G","Master",20200142,"Droit, économie, gestion","Institut Sociétés et Humanités (ISH)"]
["Université du Littoral Côte d'Opale","0595964M",21,"Contrôle de gestion et audit organisationnel","Biologie intégrative et physiologie","Comptabilité - contrôle - audit","Contrôle de gestion et audit organisationnel","Civilisations, cultures et sociétés","Génie industriel",null,"Management public",null,"Cinéma et audiovisuel","Biodiversité, écologie et évolution","Droit des affaires","Entrepreneuriat et management de projets","Informatique",null,null,null,null,"Droit privé",null,"Électronique, énergie électrique, automatique",null,"Université Polytechnique Hauts-de-France","Contrôle de gestion et audit organisationnel","0597132G","Master",20200143,"Droit, économie, gestion","Institut Sociétés et Humanités (ISH)"]
["Université d'Évry-Val-d'Essonne","0911975C",3,"Création numérique","Biologie-santé","Contrôle de gestion et audit organisationnel","Droit de la propriété intellectuelle","Création littéraire","Gestion de l'environnement",null,"Mathématiques et informatique appliquées aux Sciences humaines et sociales - MIASHS",null,"Comptabilité - contrôle - audit","Bio-informatique","Droit du patrimoine","Français langue étrangère","Innovation, entreprise et société",null,null,null,null,"Droit public",null,"Génie civil",null,"Université Polytechnique Hauts-de-France","Création numérique","0597132G","Master",20200096,"Arts, lettres, langues","Institut Sociétés et Humanités (ISH)"]
["Université de Versailles Saint-Quentin-En-Yvelines","0781944P",10,"Droit de l'immobilier","Calcul haute performance, simulation","Droit de l'économie","Droit de la santé","Création numérique","Gestion de production, logistique, achats",null,"Santé",null,"Droit de la santé","Biologie-santé","Droit public","Génie civil","Mathématiques appliquées, statistique",null,null,null,null,"Droit social",null,"Génie industriel",null,"Université Polytechnique Hauts-de-France","Droit de l'immobilier","0597132G","Master",20150562,"Droit, économie, gestion","Institut Sociétés et Humanités (ISH)"]
["Université de technologie de Compiègne","0601223D",4,"Droit des affaires","Chimie","Droit des affaires","Droit de l'immobilier","Culture et communication","Histoire",null,"Diplôme d'État de Sage-femme",null,"Droit de l'entreprise","Biotechnologies","Économie appliquée","Génie industriel","Mécanique",null,null,null,null,"Économie",null,"Génie Urbain",null,"Université Polytechnique Hauts-de-France","Droit des affaires","0597132G","Master",20200144,"Droit, économie, gestion","Institut Sociétés et Humanités (ISH)"]
["Université de Picardie Jules Verne","0801344B",57,"Droit public","Communication des organisations","Droit du numérique","Droit des affaires","Danse","Informatique",null,"Diplôme de formation approfondie en Sciences médicales",null,"Droit du patrimoine","Chimie","Energie","Gestion de production, logistique, achats","Physique",null,null,null,null,"Électronique, énergie électrique, automatique",null,"Géomatique",null,"Université Polytechnique Hauts-de-France","Droit public","0597132G","Master",20200097,"Droit, économie, gestion","Institut Sociétés et Humanités (ISH)"]
["Université de Lille","0597239Y",103,"Énergie","Comptabilité - contrôle - audit","Droit européen","Droit des assurances","Droit de la santé","Ingénierie des systèmes complexes",null,10,null,"Droit international et droit européen","Chimie et sciences du vivant","Français langue étrangère","Gestion des ressources humaines","Diplôme délivré à titre international",null,null,null,null,"Études européennes et internationales",null,"Gestion des ressources humaines",null,"Université Polytechnique Hauts-de-France","Énergie","0597132G","Master",20150566,"Sciences, technologies, santé","INSA"]
["Université de La Réunion","9740478B",37,"Entrepreneuriat et management de projets","Contrôle de gestion et audit organisationnel","Droit français - Droits étrangers","Droit du numérique","Droit privé","Instrumentation, mesure, métrologie",null,null,null,"Droit notarial","Chimie physique et analytique","Génie civil","Gestion des territoires et développement local",11,null,null,null,null,"Finance",null,"Histoire",null,"Université Polytechnique Hauts-de-France","Entrepreneuriat et management de projets","0597132G","Master",20200145,"Droit, économie, gestion","Institut Sociétés et Humanités (ISH)"]
["Université d'Artois","0623957P",25,"Génie civil","Culture, patrimoine et médiation","Droit international et droit européen","Droit européen","Droit public","Langues, littératures et civilisations étrangères et régionales",null,null,null,"Droit privé","Commerce et distribution","Géographie, aménagement, environnement et développement","Histoire, civilisations, patrimoine",null,null,null,null,null,"Génie civil",null,"Informatique",null,"Université Polytechnique Hauts-de-France","Génie civil","0597132G","Master",20200151,"Sciences humaines et sociales ; Sciences, technologies, santé","INSA"]
["Institut Polytechnique de Paris","0952198Y",11,"Gestion de patrimoine","Design","Droit notarial","Droit fiscal","Économie des organisations","Management de l'innovation",null,null,null,"Droit public","Comptabilité - contrôle - audit","Gestion des ressources humaines","Informatique",null,null,null,null,null,"Géomatique",null,"Intelligence économique",null,"Université Polytechnique Hauts-de-France","Gestion de patrimoine","0597132G","Master",20150564,"Droit, économie, gestion","Institut Sociétés et Humanités (ISH)"]
{"$rows_left_out":587}
{"sheet":"Dev","index":6,"n_rows":0,"n_cols":0,"rows_kept":0,"cut":false,"hidden":true,"merged":[]}