{"text_format":"1","workbook":"xlsx","n_sheets":6,"sheets":["Notice","1. Présentation","2. Données de caractérisation","4a. Données BUT DUT","4b. Données LP","Nomenclature"],"not_rendered":{"charts":0,"images":2,"macros":1,"external_links":0,"defined_names":18,"comments":0,"pivot_tables":0},"unopened":[],"bounds":{"document_bytes":16777216,"sheet_cells":100000,"rows_first":2000,"rows_last":500,"rows_between":2000,"halvings":0,"cell_chars":16384,"cell_head_chars":4096},"cells_cut":0,"cells_raw":0,"read":"whole","date_system":"1900"}

{"sheet":"Notice","index":0,"n_rows":49,"n_cols":3,"rows_kept":49,"cut":false,"hidden":false,"merged":[[0,2,3,12],[20,2,20,12],[21,2,21,12],[25,2,25,12],[26,2,26,12],[27,2,27,12],[19,2,19,12],[16,2,16,12],[37,1,37,12],[38,1,38,12],[23,2,23,12],[29,2,29,12],[30,2,30,12],[41,1,41,12],[43,1,43,12],[44,1,44,12],[45,1,45,12],[42,1,42,12]]}
[null,null,"DÉPARTEMENT D’ÉVALUATION DES FORMATIONS"]
["DEF BUT","V1.05"]
[]
[]
[]
[null,"Note d'utilisation"]
[]
[null,"Pourquoi ces tableaux ?"]
[null,"Ces tableaux ont pour finalité la collecte de données en vue de l'évaluation des formations de la vague C."]
[null,"Ces données seront utilisées par les comités d'experts dans le processus d'évaluation. "]
[null,"Ces données peuvent être de nature quantitative ou qualitative, à renseigner alors sous forme de texte court (environ 500 caractères par donnée)."]
[]
[null,"Comment le remplir ?"]
[null,"Le mode d'emploi est le suivant."]
[]
[null,"1. Activer le contenu à l'ouverture du fichier"]
[null,null,"À l'ouverture du fichier, il est indispensable d'accepter l'activation des macros (ou des contenus) lorsque le tableur vous y invite, sans quoi le fichier ne pourra pas fonctionner correctement."]
[]
[null,"2. Renseigner d'abord les informations de l'onglet Présentation"]
[null,null,"En premier lieu, choisir son établissement et la spécialité de BUT concernée."]
{"$rows_left_out":30}
{"sheet":"1. Présentation","index":1,"n_rows":22,"n_cols":6,"rows_kept":22,"cut":false,"hidden":false,"merged":[[5,1,5,2],[18,8,20,8],[0,1,3,6],[8,4,8,5],[10,4,10,5],[15,4,15,5],[21,4,21,5],[17,4,17,5],[19,4,19,5],[2,7,4,7],[5,7,6,7],[13,4,13,5]]}
[null,"DÉPARTEMENT D’ÉVALUATION DES FORMATIONS"]
[]
[]
[]
[]
[null,"1. Présentation de la formation"]
[]
["Code Hcéres"]
["P1","CI1","Établissement",null,"Sélectionner un établissement dans la liste déroulante."]
["P2","CI2","Code UAI",{"$f":"IF(ISERROR(VLOOKUP($D$9,Nomenclature!$A$2:$B$15,2,FALSE)),\"\",VLOOKUP($D$9,Nomenclature!$A$2:$B$15,2,FALSE))","v":""}]
["P3","CI4","Intitulé de la spécialité de BUT",null,"Sélectionner un intitulé de spécialité de BUT dans la liste déroulante.\nCet intitulé correspond à la liste envoyée par l'établissement au Hcéres le 01/10/21."]
["P6","CI5","Numéro d'identification Hcéres",{"$f":"IF(ISERROR(INDEX(Nomenclature!$U$2:$U$164,MATCH(1,(Nomenclature!$S$2:$S$164=$D$9)*(Nomenclature!$T$2:$T$164=$D$11),0))),\"\",(INDEX(Nomenclature!$U$2:$U$164,MATCH(1,(Nomenclature!$S$2:$S$164=$D$9)*(Nomenclature!$T$2:$T$164=$D$11),0))))","v":""}]
["P7","CI6","Responsable(s) de la spécialité de BUT"]
["P3-1",null,"Intitulés des parcours prévus dans la spécialité",null,"Lister les parcours en les séparant par un point-virgule."]
["P3-2",null,"Spécialité de DUT pré-existante"]
["P5","CI8","Nombre de sites de l'IUT ou des IUT portant la formation",null,"Indiquer le nombre de sites de l'IUT ou le nombre d'IUT. Ce nombre doit correspondre aux lignes qui seront ajoutées automatiquement dans l'onglet \"Données de caractérisation\" et dans l'onglet \"Données BUT DUT\".\nAttention : il ne sera pas possible d'ajouter ou de supprimer d'autres sites ou IUT par la suite, sans refaire la saisie."]
["P5-1",null,"Intitulé de chacun des sites (IUT/site)"]
["P8",null,"Nombre de mentions de LP remplacées par la spécialité de BUT",null,"Indiquer le nombre de mentions de LP. Celui-ci doit correspondre aux lignes qui seront ajoutées automatiquement dans l'onglet \"Données de caractérisation\" et dans l'onglet \"Données de LP\".\nAttention : il ne sera pas possible d'ajouter ou de supprimer d'autres mentions de LP, sans refaire la saisie."]
["P9",null,"Intitulé de la mention 1 de LP remplacée par la spécialité de BUT"]
["P12",null,"Nombre de parcours de la LP1 remplacés par la spécialité de BUT",null,"Indiquer le nombre de parcours de la LP. Celui-ci doit correspondre aux lignes qui seront ajoutées automatiquement dans l'onglet \"Données de caractérisation\" et dans l'onglet \"Données de LP\".\nAttention : il ne sera pas possible d'ajouter ou de supprimer d'autres parcours de LP, sans refaire la saisie."]
{"$rows_left_out":3}
{"sheet":"2. Données de caractérisation","index":2,"n_rows":18,"n_cols":10,"rows_kept":18,"cut":false,"hidden":false,"merged":[[9,1,9,2],[2,6,4,7],[7,1,7,6],[5,1,5,6]]}
[]
[]
[]
[]
[]
[null,{"$f":"'1. Présentation'!D11","v":0}]
[]
[null,"2. Données de caractérisation de la formation"]
[]
[null,"Données de caractérisation",null,"Année 2018-2019","Année 2019-2020","Année 2020-2021"," \nAnnée 2021-2022 (BUT)","Commentaire (non obligatoire)"]
[null,"DC 1","Nombre total d'inscrits administratifs en 1re année du cycle (BUT1)*"]
[null,"DC 2","dont étudiants internationaux"]
[null,"DC 3","dont étudiants ayant des besoins spécifiques"]
["IG1","DC 4","Nombre total d'hommes inscrits en 1re année du cycle (BUT1)",null,null,null,null,null,null,"IG1"]
["IG1","DC 5","Nombre total de femmes inscrites en 1re année du cycle (BUT1)",null,null,null,null,null,null,"IG1"]
[null,"DC 7","Nombre d'inscrits administratifs en 2e année du cycle (DUT2)*"]
[null,"DC 9","Capacité d'accueil (BUT1)*"]
[null,"DC 8","Nombre d'inscrits administratifs en 3e année du cycle (LP)*"]

{"sheet":"4a. Données BUT DUT","index":3,"n_rows":104,"n_cols":11,"rows_kept":104,"cut":false,"hidden":false,"merged":[[5,1,5,2],[7,1,7,2],[32,2,33,2],[35,2,37,2],[12,1,46,1],[28,2,29,2],[23,2,24,2],[26,2,27,2],[8,1,8,11],[93,2,94,2],[96,2,99,2],[10,9,11,9],[10,2,11,2],[20,2,22,2],[10,6,10,8],[10,3,11,3],[10,5,11,5],[74,1,89,1],[47,1,73,1],[10,10,11,10],[10,4,11,4],[103,2,104,2],[38,2,41,2],[90,1,104,1],[42,2,46,2],[49,2,51,2],[57,2,63,2],[66,2,71,2],[72,2,73,2],[76,2,80,2],[82,2,84,2],[86,2,89,2],[91,2,92,2]]}
[]
[]
[]
[]
[]
[null,{"$f":"'1. Présentation'!D11","v":0}]
[]
[null,"4. Données BUT/DUT"]
[null,"Pour chacun des critères ci-dessous, renseigner, selon ce qui est indiqué dans le tableau, soit des données qualitatives, soit des données quantitatives (les données non attendues sont grisées). Pour les données quantitatives, indiquer une valeur caractérisant la formation (DUT ou BUT). Les données concernant le DUT 2 sont à renseigner soit pour chacune des années de référence (2018-2019, 2019-2020 et 2020-2021), soit uniquement pour l’année 2020-2021 (dans ce cas, les années 2018-2019 et 2019-2020 sont grisées). Pour les données concernant le BUT, indiquer uniquement la valeur correspondant à 2021-2022."]
[]
[null,null,"Référentiel Hcéres - formations 1er et 2e cycle","Code de la donnée  ","Données qualitatives\n (à remplir à la place des consignes - 500 caractères maximum)","Données quantitatives","Valeurs pour chaque année de la période de référence",null,null,"Année 2021-2022 (BUT1)","Analyse obligatoire des données quantitatives (prise en compte des recommandations de l'évaluation externe, explication des évolutions, freins et leviers, mesures correctives)\n500 caractères maximum"]
[null,null,null,null,null,null,"Année 2018-2019\n(DUT2)","Année 2019-2020\n(DUT2)","Année 2020-2021\n(DUT2)"]
[null,"Domaine 1 : La politique et la caractérisation de la formation","Référence 1 : La formation est en adéquation avec la stratégie formation de l’établissement."]
[null,null,"C1. La formation s’inscrit dans les ambitions, les orientations pédagogiques et les priorités thématiques de l’établissement.","Document 1","Critère évalué sur la base du document n°1 ayant valeur de preuve"]
[null,null,"C2. La formation est construite en cohérence et complémentarité avec les autres formations du même cycle et en articulation avec celles des autres cycles avec lesquelles elle s’inscrit en continuum.","Document 1","Critère évalué sur la base du document n°1 ayant valeur de preuve"]
[null,null,"C3. La formation s’assure de la réalité et de la valeur ajoutée de ses partenariats académiques locaux, régionaux et nationaux.","DQL 1-3","Pour le BUT1 et le DUT2, principaux éléments de collaboration des parcours construits en partenariats (existence d'une équipe pédagogique commune, d'enseignements communs, de modalités de pilotage commun de la formation)"]
[null,null,"C4. La formation identifie l’apport de la pluridisciplinarité et de l’interdisciplinarité à sa finalité.","DQL 1-4","Pour le BUT1, prise en compte du Programme national sur les principaux constituants de la pluridiscplinarité et/ou de l'interdisciplinarité dans la formation (disciplines, dispositifs, exemples d'enseignements ou de projets)"]
[null,null,"C5. La formation intègre les enjeux du développement durable.","DQL 1-5","Pour le BUT1, prise en compte du Programme national sur  les compétences visées, modalités de formation (enseignements dédiés, projets, etc.)"]
[null,null,"C6. La formation s’appuie sur les actions menées et sur les moyens obtenus dans le cadre de l’initiative d’excellence et des projets connexes dépendant du PIA, pour dynamiser son contenu et ses dispositifs.","DQL-1-6","Pour le BUT1 et le DUT2, si la formation est concernée : dispositifs  financés par l'initiative d'excellence (parcours, heures d'enseignement, écoles d'été, etc.)"]
[null,null,"Référence 2 : La formation est ouverte à l’international en cohérence avec les priorités définies par l’établissement."]
{"$rows_left_out":85}
{"sheet":"4b. Données LP","index":4,"n_rows":100,"n_cols":10,"rows_kept":100,"cut":false,"hidden":false,"merged":[[5,1,5,2],[7,1,7,2],[10,2,11,2],[10,3,11,3],[10,4,11,4],[8,1,8,9],[10,5,11,5],[10,6,10,8],[10,9,11,9],[12,1,44,1],[20,2,21,2],[22,2,23,2],[25,2,26,2],[27,2,28,2],[31,2,32,2],[34,2,36,2],[37,2,40,2],[41,2,44,2],[87,1,99,1],[90,2,91,2],[98,2,99,2],[45,1,68,1],[47,2,49,2],[55,2,58,2],[61,2,66,2],[67,2,68,2],[69,1,86,1],[71,2,72,2],[74,2,75,2],[77,2,86,2],[88,2,89,2],[93,2,94,2]]}
[]
[]
[]
[]
[]
[null,{"$f":"'1. Présentation'!D11","v":0}]
[]
[null,"4. Données LP"]
[null,"Pour chacun des critères ci-dessous, renseigner, selon ce qui est indiqué dans le tableau, soit des données qualitatives, soit des données quantitatives (les données non attendues sont grisées). Pour les données quantitatives, indiquer une valeur caractérisant la formation soit pour chacune des années de référence (2018-2019, 2019-2020 et 2020-2021), soit uniquement pour l’année 2020-2021 (dans ce cas, les années 2018-2019 et 2019-2020 sont grisées dans le tableau)."]
[]
[null,null,"Référentiel Hcéres - formations 1er et 2e cycle","Code de la donnée","Données qualitatives\n (à remplir à la place des consignes - 500 caractères maximum) ","Données quantitatives","Valeurs pour chaque année de la période de référence",null,null,"Analyse obligatoire des données quantitatives (prise en compte des recommandations de l'évaluation externe, explication des évolutions, freins et leviers, mesures correctives)\n500 caractères maximum"]
[null,null,null,null,null,null,"Année 2018-2019","Année 2019-2020","Année 2020-2021"]
[null,"Domaine 1 : La politique et la caractérisation de la formation","Référence 1 : La formation est en adéquation avec la stratégie formation de l’établissement."]
[null,null,"C1. La formation s’inscrit dans les ambitions, les orientations pédagogiques et les priorités thématiques de l’établissement.","Document 1","Critère évalué sur la base du document n°1 ayant valeur de preuve"]
[null,null,"C2. La formation est construite en cohérence et complémentarité avec les autres formations du même cycle et en articulation avec celles des autres cycles avec lesquelles elle s’inscrit en continuum.","Document 1","Critère évalué sur la base du document n°1 ayant valeur de preuve"]
[null,null,"C3. La formation s’assure de la réalité et de la valeur ajoutée de ses partenariats académiques locaux, régionaux et nationaux.","DQL 1-3","Principaux éléments de collaboration dans le cadre parcours construits en partenariats (existence d'une équipe pédagogique commune, d'enseignements communs, de modalités de pilotage commun de la formation)"]
[null,null,"C4. La formation identifie l’apport de la pluridisciplinarité et de l’interdisciplinarité à sa finalité."]
[null,null,"C5. La formation intègre les enjeux du développement durable."]
[null,null,"C6. La formation s’appuie sur les actions menées et sur les moyens obtenus dans le cadre de l’initiative d’excellence et des projets connexes dépendant du PIA, pour dynamiser son contenu et ses dispositifs."]
[null,null,"Référence 2 : La formation est ouverte à l’international en cohérence avec les priorités définies par l’établissement."]
{"$rows_left_out":81}
{"sheet":"Nomenclature","index":5,"n_rows":164,"n_cols":23,"rows_kept":164,"cut":false,"hidden":true,"merged":[]}
["Établissements","Codes UAI",null,"Aix_Marseille_Université_AMU","Avignon_Université","Université_de_Bourgogne_UB","Università_di_Corsica_Pasquale_Paoli","Université_Côte_d_Azur","Université_de_Franche_Comté_UFC_U_Besançon","Université_de_Haute_Alsace_UHA","Université_de_Lorraine_UL","Université_d_Orléans","Université_de_la_Nouvelle_Calédonie_UNC","Universite_de_Reims_Champagne_Ardenne_URCA","Université_de_Strasbourg_Unistra","Université_de_Toulon","Université_de_Tours",{"$f":"SUM(R2:R166)","v":163},"Libellé établissement","Intitulé indiqué dans l'arrêté d'accréditation","Numéro d'identification Hcéres","Type de formation indiqué dans l'arrêté d'accréditation","Domaine indiqué dans l'arrêté d'accréditation"]
["Aix_Marseille_Université_AMU","0134009M",{"$f":"D20","v":18},"Carrières Sociales","Génie Biologique","Carrières Juridiques","Génie Biologique","Carrières Sociales","Carrières sociales","Carrières Juridiques","Chimie","Carrières Sociales","Gestion des Entreprises et des Administrations","Carrières Juridiques","Chimie","Génie Biologique","Carrières Sociales",{"$f":"COUNTA(S2:S19)","v":18},"Aix_Marseille_Université_AMU","Carrières Sociales","BUT_001","BUT"]
["Avignon_Université","0840685N",{"$f":"E6","v":4},"Chimie","Packaging, Emballage et Conditionnement","Génie Biologique","Génie Civil - Construction Durable","Génie Electrique et Informatique Industrielle","Chimie","Génie Biologique","Génie Biologique","Chimie","Métiers du Multimédia et de l'Internet","Carrières Sociales","Génie Biologique","Génie Electrique et Informatique Industrielle","Génie Biologique",null,"Aix_Marseille_Université_AMU","Chimie","BUT_002","BUT"]
["Université_de_Bourgogne_UB","0211237F",{"$f":"F18","v":16},"Génie Biologique","Statistique et Informatique Décisionnelle","Génie Civil - Construction Durable","Gestion des Entreprises et des Administrations","Gestion des Entreprises et des Administrations","Génie civil - Construction durable","Génie Electrique et Informatique Industrielle","Génie Chimique Génie des Procédés","Génie Civil - Construction Durable",{"$f":"COUNTA(M2:M3)","v":2},"Génie Civil – Construction Durable","Génie Civil - Construction durable","Génie Industriel et Maintenance","Génie Electrique et Informatique  \nIndustrielle ",null,"Aix_Marseille_Université_AMU","Génie Biologique","BUT_003","BUT"]
["Università_di_Corsica_Pasquale_Paoli","7200664J",{"$f":"G8","v":6},"Génie Chimique - Génie des Procédés","Techniques de Commercialisation","Génie Electrique et Informatique Industrielle","Hygiène Sécurité Environnement","Information Communication","Génie électrique et informatique industrielle","Génie Mécanique et Productique","Génie Civil - Construction Durable","Génie Electrique et Informatique Industrielle",null,"Génie Electrique et Informatique Industrielle","Génie Electrique et Informatique Industrielle","Génie Mécanique et Productique","Gestion des Entreprises et des Administrations",null,"Aix_Marseille_Université_AMU","Génie Chimique - Génie des Procédés","BUT_004","BUT"]
["Université_Côte_d_Azur","0062126D",{"$f":"H11","v":9},"Génie Civil - Construction Durable",4,"Génie Industriel et Maintenance","Métiers du Multimédia et de l'Internet","Informatique","Génie industriel et maintenance","Génie Thermique et Energie","Génie Electrique et Informatique Industrielle","Génie Industriel et Maintenance",null,"Génie Industriel et Maintenance","Génie Industriel et Maintenance","Gestion des Entreprises et des Administrations","Information et Communication ",null,"Aix_Marseille_Université_AMU","Génie Civil - Construction Durable","BUT_005","BUT"]
["Université_de_Franche_Comté_UFC_U_Besançon","0251215K",{"$f":"I19","v":17},"Génie Electrique et Informatique Industrielle",null,"Génie Mécanique et Productique","Techniques de Commercialisation","Qualité, Logistique Industrielle et Organisation","Génie mécanique et productique","Gestion des Entreprises et des Administrations","Génie Industriel et Maintenance","Génie Mécanique et Productique",null,"Génie Mécanique et Productique","Gestion des Entreprises et des Administrations","Métiers du Multimédia et de l'Internet","Mesures physiques",null,"Aix_Marseille_Université_AMU","Génie Electrique et Informatique Industrielle","BUT_006","BUT"]
["Université_de_Haute_Alsace_UHA","0681166Y",{"$f":"J14","v":12},"Génie Mécanique et Productique",null,"Gestion Administrative et Commerciale des Organisations",6,"Réseaux et Télécommunications","Génie thermique et énergie","Gestion Logistique et Transport","Génie Mécanique et Productique","Génie Thermique et Energie",null,"Gestion Administrative et Commerciale des Organisations","Information Communication","Techniques de Commercialisation","Métiers du multimédia et de l'internet",null,"Aix_Marseille_Université_AMU","Génie Mécanique et Productique","BUT_007","BUT"]
["Université_de_Lorraine_UL","0542493S",{"$f":"K23","v":21},"Génie Thermique et Energie",null,"Gestion des Entreprises et des Administrations",null,"Statistique et Informatique Décisionnelle","Gestion administrative et commerciale des organisations","Hygiène Sécurité Environnement","Génie Thermique et Energie","Gestion des Entreprises et des Administrations",null,"Gestion des Entreprises et des Administrations","Informatique",7,"Réseaux et télécommunications ",null,"Aix_Marseille_Université_AMU","Génie Thermique et Energie","BUT_008","BUT"]
["Université_de_la_Nouvelle_Calédonie_UNC","9830445S",{"$f":"M4","v":2},"Gestion Administrative et Commerciale des Organisations",null,"Gestion Logistique et Transport",null,"Techniques de Commercialisation","Gestion des entreprises et des administrations","Métiers du Multimédia et de l'Internet","Gestion Administrative et Commerciale des Organisations","Gestion Logistique et Transport",null,"Gestion Logistique et Transport","Mesures Physiques",null,"Science et génie des matériaux",null,"Aix_Marseille_Université_AMU","Gestion Administrative et Commerciale des Organisations","BUT_009","BUT"]
["Université_d_Orléans","0450855K",{"$f":"L15","v":13},"Gestion des Entreprises et des Administrations",null,"Information Communication",null,9,"Gestion logistique et transport","Réseaux et Télécommunications","Gestion des Entreprises et des Administrations","Informatique",null,"Hygiène Sécurité Environnement","Métiers du Multimédia et de l'Internet",null,"Techniques de commercialisation",null,"Aix_Marseille_Université_AMU","Gestion des Entreprises et des Administrations","BUT_010","BUT"]
["Université_de_Reims_Champagne_Ardenne_URCA","0511296G",{"$f":"N18","v":16},"Gestion Logistique et Transport",null,"Informatique",null,null,"Hygiène Sécurité Environnement","Science et Génie des Matériaux","Gestion Logistique et Transport","Mesures Physiques",null,"Informatique","Qualité, Logistique Industrielle et Organisation",null,10,null,"Aix_Marseille_Université_AMU","Gestion Logistique et Transport","BUT_011","BUT"]
["Université_de_Strasbourg_Unistra","0673021V",{"$f":"O14","v":12},"Hygiène Sécurité Environnement",null,"Mesures Physiques",null,null,"Information communication","Techniques de Commercialisation","Hygiène Sécurité Environnement","Qualité, Logistique Industrielle et Organisation",null,"Mesures Physiques","Techniques de Commercialisation",null,null,null,"Aix_Marseille_Université_AMU","Hygiène Sécurité Environnement","BUT_012","BUT"]
["Université_de_Toulon","0830766G",{"$f":"P9","v":7},"Information Communication",null,"Métiers du Multimédia et de l'Internet",null,null,"Informatique",12,"Information Communication","Techniques de Commercialisation",null,"Métiers du Multimédia et de l'Internet",12,null,null,null,"Aix_Marseille_Université_AMU","Information Communication","BUT_013","BUT"]
["Université_de_Tours","0370800U",{"$f":"Q12","v":10},"Informatique",null,"Réseaux et Télécommunications",null,null,"Mesures physiques",null,"Informatique",13,null,"Packaging, Emballage et Conditionnement",null,null,null,null,"Aix_Marseille_Université_AMU","Informatique","BUT_014","BUT"]
[null,null,null,"Mesures Physiques",null,"Science et Génie des Matériaux",null,null,"Métiers du multimédia et de l'internet",null,"Mesures Physiques",null,null,"Réseaux et Télécommunications",null,null,null,null,"Aix_Marseille_Université_AMU","Mesures Physiques","BUT_015","BUT"]
[null,null,{"$f":"SUM(C2:C15)","v":163},"Métiers du Multimédia et de l'Internet",null,"Techniques de Commercialisation",null,null,"Réseaux et télécommunications",null,"Métiers du Multimédia et de l'Internet",null,null,"Techniques de Commercialisation",null,null,null,null,"Aix_Marseille_Université_AMU","Métiers du Multimédia et de l'Internet","BUT_163","BUT"]
["OUI",{"$f":"R1","v":163},null,"Réseaux et Télécommunications",null,16,null,null,"Techniques de commercialisation",null,"Qualité, Logistique Industrielle et Organisation",null,null,16,null,null,null,null,"Aix_Marseille_Université_AMU","Réseaux et Télécommunications","BUT_016","BUT"]
["NON",null,null,"Techniques de Commercialisation",null,null,null,null,17,null,"Réseaux et Télécommunications",null,null,null,null,null,null,null,"Aix_Marseille_Université_AMU","Techniques de Commercialisation","BUT_017","BUT"]
[null,{"$f":"C17=B18","v":true},null,{"$f":"COUNTA(Aix_Marseille_Université_AMU)","v":18},null,null,null,null,null,null,"Science et Génie des Matériaux",null,null,null,null,null,null,{"$f":"COUNTA(S20:S23)","v":4},"Avignon_Université","Génie Biologique","BUT_018","BUT"]
{"$rows_left_out":144}