{"text_format":"1","workbook":"xlsx","n_sheets":6,"sheets":["Notice","1. Présentation","2. Données de caractérisation","3. Auto-positionnement","4. Données","Nomenclature"],"not_rendered":{"charts":0,"images":1,"macros":1,"external_links":0,"defined_names":24,"comments":0,"pivot_tables":0},"unopened":[],"bounds":{"document_bytes":16777216,"sheet_cells":100000,"rows_first":2000,"rows_last":500,"rows_between":2000,"halvings":0,"cell_chars":16384,"cell_head_chars":4096},"cells_cut":0,"cells_raw":0,"read":"whole","date_system":"1900"}

{"sheet":"Notice","index":0,"n_rows":41,"n_cols":3,"rows_kept":41,"cut":false,"hidden":false,"merged":[[0,2,3,12]]}
[null,null,"DÉPARTEMENT D’ÉVALUATION DES FORMATIONS"]
["DEF 2e cycle","V2.09"]
[]
[]
[]
[null,"Note d'utilisation"]
[]
[null,"Pourquoi ces tableaux ?"]
[null,"Ces tableaux ont pour finalité la collecte de données en vue de l'évaluation des formations de la vague C."]
[null,"Ces données seront utilisées par les comités d'experts dans le processus d'évaluation. "]
[null,"Ces données peuvent être de nature quantitative ou qualitative, à renseigner alors sous forme de texte court (environ 500 caractères par donnée)."]
[]
[null,"Comment le remplir ?"]
[null,"Le mode d'emploi est le suivant."]
[]
[null,"1. Activer le contenu à l'ouverture du fichier"]
[null,null,"À l'ouverture du fichier, il est indispensable d'accepter l'activation des macros (ou des contenus) lorsque le tableur vous y invite, sans quoi le fichier ne pourra pas fonctionner correctement."]
[]
[null,"2. Renseigner d'abord les informations de l'onglet Présentation"]
[null,null,"En premier lieu, choisissez votre établissement et la formation concernée."]
{"$rows_left_out":22}
{"sheet":"1. Présentation","index":1,"n_rows":905,"n_cols":6,"rows_kept":905,"cut":false,"hidden":false,"merged":[[17,5,17,11],[10,5,10,11],[8,5,8,11],[15,5,15,11],[5,1,5,2],[1,6,6,11],[0,1,3,4]]}
[null,"DÉPARTEMENT D’ÉVALUATION DES FORMATIONS"]
[]
[]
[]
[]
[null,"1. Présentation de la formation"]
[]
["Code Hcéres"]
["P1","CI1","Établissement",null,null,"Sélectionner un établissement dans la liste déroulante"]
["P2","CI2","Code UAI",{"$f":"IF(ISERROR(VLOOKUP($D$9,Nomenclature!$A$2:$B$22,2,FALSE)),\"\",VLOOKUP($D$9,Nomenclature!$A$2:$B$22,2,FALSE))","v":""}]
["P3","CI4","Intitulé de la formation",null,null,"Sélectionner un intitulé de formation dans la liste déroulante. \nCet intitulé correspond à la liste envoyée par l'établissement au Hcéres le 01/10/2021."]
["P4",null,"Type de cursus",{"$f":"IF(ISERROR(INDEX(Nomenclature!$AC$2:$AC$645,MATCH(1,(Nomenclature!$Z$2:$Z$645=$D$9)*(Nomenclature!$AA$2:$AA$645=$D$11),0))),\"\",(INDEX(Nomenclature!$AC$2:$AC$645,MATCH(1,(Nomenclature!$Z$2:$Z$645=$D$9)*(Nomenclature!$AA$2:$AA$645=$D$11),0))))","v":""}]
["P5","s","Lieu(x) de formation (y compris parcours délocalisés)"]
["P6","CI5","Numéro d'accréditation",{"$f":"IF(ISERROR(INDEX(Nomenclature!$AB$2:$AB$645,MATCH(1,(Nomenclature!$Z$2:$Z$645=$D$9)*(Nomenclature!$AA$2:$AA$645=$D$11),0))),\"\",(INDEX(Nomenclature!$AB$2:$AB$645,MATCH(1,(Nomenclature!$Z$2:$Z$645=$D$9)*(Nomenclature!$AA$2:$AA$645=$D$11),0))))","v":""}]
["P7","CI6","Responsable(s) de la formation"]
["P8","CI8","Nombre de parcours de la formation",null,null,"Indiquer le nombre de parcours. Celui-ci doit correspondre aux lignes qui seront ajoutées automatiquement dans les données déclinées par parcours. \nAttention : il ne sera pas possible d'ajouter ou de supprimer d'autres parcours par la suite, sans refaire la saisie."]
["P9",null,"Intitulé des parcours"]
["P10","CI9","Éléments différenciants de la formation",null,null,"Préciser les particularités de la formation ou d’un parcours de la mention devant être pris en considération pour la compréhension des données (ex: parcours exclusivement réservé aux étudiants internationaux)."]
[]
[]
{"$rows_left_out":886}
{"sheet":"2. Données de caractérisation","index":2,"n_rows":22,"n_cols":9,"rows_kept":22,"cut":false,"hidden":false,"merged":[[9,1,9,2],[6,5,6,9],[0,1,3,5],[7,1,7,2],[5,1,5,5]]}
[null,"DÉPARTEMENT D’ÉVALUATION DES FORMATIONS"]
[]
[]
[]
[]
[null,{"$f":"'1. Présentation'!D11","v":0}]
[]
[null,"2. Données de caractérisation de la formation"]
[]
[null,"Données de caractérisation",null,"Année 2018-2019","Année 2019-2020","Année 2020-2021","Commentaire (non obligatoire)"]
["IG1","DC 1","Nombre total d’inscrits administratifs dans la formation* (dans tout le cycle)",null,null,null,null,null,"IG1"]
[null,"DC 2","dont étudiants internationaux* (Cf. définition dans le glossaire)"]
[null,"DC 3","dont étudiants ayant des besoins spécifiques (Cf. Définition dans le glossaire)"]
["IG1","DC 4","Nombre total d’hommes inscrits dans la formation (inscrits administratifs dans tout le cycle)",null,null,null,null,null,"IG1"]
["IG1","DC 5","Nombre total de femmes inscrites dans la formation (inscrits administratifs dans tout le cycle)",null,null,null,null,null,"IG1"]
[null,"DC 6","Nombre total d’inscrits administratifs en 1ère année du cycle*"]
[null,"DC 7","Nombre total d’inscrits administratifs en 2e année du cycle*"]
[null,"DC 8","Nombre total d’inscrits en 3e année du cycle* (DFA en sciences médicales)"]
[null,"DC 10","Capacité d'accueil*"]
[null,"DC 13","Nombre d’inscrits en double inscription avec un diplôme paramédical"]
{"$rows_left_out":3}
{"sheet":"3. Auto-positionnement","index":3,"n_rows":68,"n_cols":10,"rows_kept":68,"cut":false,"hidden":false,"merged":[[3,6,4,10],[8,1,8,10],[17,2,17,6],[10,1,13,1],[17,7,18,7],[0,1,3,5],[7,1,7,2],[5,1,5,6],[67,2,67,6],[19,1,38,1],[59,1,67,1],[52,1,58,1],[39,1,51,1],[62,2,62,6],[63,2,63,6],[64,2,64,6],[65,2,65,6],[66,2,66,6],[57,2,57,6],[58,2,58,6],[59,2,59,6],[60,2,60,6],[61,2,61,6],[52,2,52,6],[53,2,53,6],[54,2,54,6],[55,2,55,6],[56,2,56,6],[47,2,47,6],[48,2,48,6],[49,2,49,6],[50,2,50,6],[51,2,51,6],[42,2,42,6],[43,2,43,6],[44,2,44,6],[45,2,45,6],[46,2,46,6],[38,2,38,6],[39,2,39,6],[40,2,40,6],[41,2,41,6],[33,2,33,6],[34,2,34,6],[35,2,35,6],[36,2,36,6],[37,2,37,6],[28,2,28,6],[29,2,29,6],[30,2,30,6],[31,2,31,6],[32,2,32,6],[24,2,24,6],[25,2,25,6],[26,2,26,6],[27,2,27,6],[19,2,19,6],[20,2,20,6],[21,2,21,6],[22,2,22,6],[23,2,23,6]]}
[null,"DÉPARTEMENT D’ÉVALUATION DES FORMATIONS"]
[]
[]
[]
[]
[null,{"$f":"'1. Présentation'!D11","v":0}]
[]
[null,"3. Auto-positionnement de la formation"]
[null,"Pour chacun des critères d'autoévaluation ci-dessous, la formation positionne son degré d’avancement, sur une échelle de 1 à 5, définie ci-dessous."]
[null,"Niveau atteint",1,2,3,4,5]
[null,"Définition du niveau","Absence de politique","Politique définie","Politique appliquée ","Politique appliquée ","Politique appliquée"]
[null,null,"Action(s) envisagée(s)","Action(s) en cours de mise place","Action(s) en place","Action(s) en place","Action(s) en place"]
[null,null,"Pas de résultats obtenus","Résultats insuffisants","Résultats encourageants","Résultats satisfaisants","Très bons résultats"]
[null,null,"Pas d'amélioration continue","Processus d'autoévaluation défini","Autoévaluation occasionnelle","Autoévaluation régulière","Processus d'amélioration continue mis en œuvre "]
[null,null,"Les actions mises en œuvre et les résultats obtenus peuvent concerner, selon les critères, l'activité des enseignants, des étudiants, des enseignements ou des dispositifs."]
[null,null,"Par amélioration continue, on entend que les résultats sont analysés et les mesures correctives sont décidées et mises en œuvre."]
[]
[null,null,"Référentiel Hcéres - formations 2e cycle",null,null,null,null,"Code de la donnée ","Niveau atteint ","Analyse de l'auto-positionnement"]
[null,null,null,null,null,null,null,null,"1, 2, 3, 4 ou 5","Justification obligatoire : freins et leviers (500 caractères maximum)"]
[null,"Domaine 1 : La politique et la caractérisation de la formation","Référence 1 : La formation est en adéquation avec la stratégie de formation de l’établissement."]
{"$rows_left_out":49}
{"sheet":"4. Données","index":4,"n_rows":114,"n_cols":10,"rows_kept":114,"cut":false,"hidden":false,"merged":[[80,2,84,2],[97,1,113,1],[98,2,99,2],[100,2,101,2],[112,2,113,2],[75,1,96,1],[77,2,78,2],[86,2,96,2],[103,2,108,2],[10,9,11,9],[39,2,42,2],[10,4,11,4],[12,1,47,1],[14,2,15,2],[21,2,23,2],[27,2,28,2],[29,2,30,2],[33,2,34,2],[36,2,38,2],[43,2,47,2],[1,3,4,8],[5,3,7,8],[10,6,10,8],[48,1,74,1],[10,2,11,2],[10,5,11,5],[24,2,25,2],[10,3,11,3],[50,2,52,2],[58,2,64,2],[67,2,72,2],[0,1,3,2],[5,1,5,2],[7,1,7,2],[73,2,74,2]]}
[null,"DÉPARTEMENT D’ÉVALUATION DES FORMATIONS"]
[]
[]
[]
[]
[null,{"$f":"'1. Présentation'!D11","v":0}]
[]
[null,"4. Données"]
[null,"Pour chacun des critères ci-dessous, indiquer une valeur caractérisant la formation pour chacune des années de référence. Si la donnée est invariante dans la période de référence, indiquer la valeur correspondant à la colonne 2020-2021."]
[]
[null,null,"Référentiel Hcéres - formations 2e cycle","Code de la donnée","Données qualitatives\n(À remplir à la place des consignes - 500 caractères maximum)","Données quantitatives","Valeur pour chaque année de la période de référence",null,null,"Analyse obligatoire des données quantitatives (prise en compte des recommandations du Hcéres, explication des évolutions, freins et leviers, mesures correctives) 500 caractères maximum"]
[null,null,null,null,null,null,"Année 2018-2019","Année 2019-2020","Année 2020-2021"]
[null,"Domaine 1 : La politique et la caractérisation de la formation","Référence 1 : La formation est en adéquation avec la stratégie de formation de l’établissement."]
[null,null,"C1. La formation s’inscrit dans les ambitions, les orientations pédagogiques et les priorités thématiques de l’établissement.","Document 1","Critère évalué sur la base du document n°1 ayant valeur de preuve "]
[null,null,"C2. La formation est construite en cohérence et complémentarité avec les autres formations du même cycle et en articulation avec celles des autres cycles avec lesquelles elle s’inscrit en continuum.","Document 1","Critère évalué sur la base du document n°1 ayant valeur de preuve "]
[null,null,null,"DQL 1-2","Cursus antérieur(s) construit(s) en continuum avec la formation"]
[null,null,"C3. La formation s’assure de la réalité et de la valeur ajoutée de ses partenariats académiques locaux, régionaux et nationaux.","DQL 1-3","Principaux éléments de collaboration dans le cadre de parcours construits en partenariats (existence d'une équipe pédagogique commune, d'enseignements communs, de modalités de pilotage commun de la formation)"]
[null,null,"C4. La formation identifie l’apport de la pluridisciplinarité et de l’interdisciplinarité à sa finalité.","DQL 1-4","Principaux constituants de la pluridiscplinarité et/ou de l'interdisciplinarité dans la formation (disciplines, dispositifs, exemples d'enseignements ou de projets)."]
[null,null,"C5. La formation intègre les enjeux du développement durable.","DQL 1-5","Compétences visées, modalités de formation (enseignements dédiés, projets, etc.)"]
[null,null,"C6. La formation s’appuie sur les actions menées et sur les moyens obtenus dans le cadre de l’initiative d’excellence et des projets connexes dépendant du PIA, pour dynamiser son contenu et ses dispositifs.","DQL-1-6","Dispositifs  financés par l'initiative d'excellence (parcours, heures d'enseignement, écoles d'été, etc.)"]
{"$rows_left_out":95}
{"sheet":"Nomenclature","index":5,"n_rows":645,"n_cols":29,"rows_kept":645,"cut":false,"hidden":true,"merged":[]}
["Établissements","Codes UAI",null,"Agrosup_Dijon","Aix_Marseille_Université_AMU","Avignon_Université","Université_de_Bourgogne_UB","Comue_Bourgogne_Franche_Comté","Università_di_Corsica_Pasquale_Paoli","Université_Côte_d_Azur","École_centrale_de_Marseille ","EURECOM","Université_de_Franche_Comté_UFC_U_Besançon","Université_de_Haute_Alsace_UHA","Université_de_Lorraine_UL","Université_de_la_Nouvelle_Calédonie_UNC","Université_d_Orléans","Université_de_la_Polynésie_française_UPF","Université_de_Reims_Champagne_Ardenne_URCA","Université_de_Strasbourg_Unistra","Université_de_technologie_de_Belfort_Montbéliard_UTBM","Université_de_technologie_de_Troyes_UTT","Université_de_Toulon","Université_de_Tours",null,"Libellé établissement","Intitulé indiqué dans l'arrêté d'accréditation","Numéro d'accréditation de la mention","Type de formation indiqué dans l'arrêté d'accréditation"]
["Agrosup_Dijon","0212198A",{"$f":"D3","v":1},"Agrosciences, Environnement, Territoires, Paysages, Forêt (AETPF)","Diplôme de formation approfondie en sciences médicales (DFASM)","Culture et communication","Diplôme de formation approfondie en sciences médicales (DFASM)","Automatique, robotique","Droit des affaires ","Diplôme de formation approfondie en sciences médicales (DFASM)","Ingénierie des systèmes complexes","Informatique","Diplôme de formation approfondie en sciences médicales (DFASM) ","Arts, lettres et civilisations","Diplôme de formation approfondie en sciences médicales (DFASM)","Civilisations, cultures et sociétés","Agrosciences, environnement, territoires, paysage, forêt  ","Biodiversité, Écologie, Évolution","Diplôme de formation approfondie en sciences médicales (DFASM)","Diplôme de formation approfondie en sciences médicales (DFASM)","Management","Ingénierie des systèmes\ncomplexes","Chimie et sciences des matériaux","Diplôme de formation approfondie en sciences médicales (DFASM)",1,"Agrosup_Dijon","Agrosciences, Environnement, Territoires, Paysages, Forêt (AETPF)",20190394,"Master"]
["Aix_Marseille_Université_AMU","0134009M",{"$f":"E98","v":96},1,"Diplôme de formation approfondie en sciences odontologiques (DFASO)","Droit","Diplôme de formation approfondie en sciences pharmaceutiques (DFASP)","Biologie de la conservation","Droit des collectivités territoriales","Diplôme de formation approfondie en sciences odontologiques (DFASO)",1,"Réseaux et télécommunication","Diplôme de formation approfondie en sciences pharmaceutiques (DFASP)","Contrôle de gestion et audit organisationnel","Diplôme de formation approfondie en sciences odontologiques (DFASO)","Droit","Automatique, robotique  ","Droit privé","Diplôme de formation approfondie en sciences odontologiques (DFASO)","Diplôme de formation approfondie en sciences odontologiques (DFASO)",1,"Risques et environnement","Civilisations, cultures et sociétés","Diplôme de formation approfondie en sciences pharmaceutiques (DFASP)",{"$f":"COUNTA(Z3:Z98)","v":96},"Aix_Marseille_Université_AMU","Diplôme de formation approfondie en sciences médicales (DFASM)","NOACCRR2C_02","DFA"]
["Avignon_Université","0840685N",{"$f":"F15","v":13},null,"Diplôme de formation approfondie en sciences pharmaceutiques (DFASP)","Français langue étrangère","Diplôme d’État d’infirmier en pratique avancée (IPA)","Chimie moléculaire","Droit du numérique","Diplôme d’État d’infirmier en pratique avancée (IPA)",null,{"$f":"COUNTA(EURECOM)","v":2},"Diplôme d’État d’infirmier en pratique avancée (IPA)","Droit  ","Diplôme de formation approfondie en sciences pharmaceutiques (DFASP)","Gestion de l'environnement","Chimie moléculaire  ","Droit public","Diplôme de formation approfondie en sciences pharmaceutiques (DFASP)","Diplôme de formation approfondie en sciences pharmaceutiques (DFASP)",null,2,"Création numérique","Diplôme d’État d’infirmier en pratique avancée (IPA)",null,"Aix_Marseille_Université_AMU","Diplôme de formation approfondie en sciences odontologiques (DFASO)","NOACCRR2C_03","DFA"]
["Université_de_Bourgogne_UB","0211237F",{"$f":"G51","v":49},null,"Diplôme d’État d’infirmier en pratique avancée (IPA)","Géographie, aménagement, environnement et développement","Diplôme d'État de sage-femme","Culture et communication","Droit notarial","Diplôme d'État de sage-femme",null,null,"Diplôme d'État de sage-femme","Économie sociale et solidaire","Diplôme d’État d’infirmier en pratique avancée (IPA)","Gestion des territoires et développement local","Comptabilité - contrôle - audit  ","Langues et sociétés","Diplôme d’État d’infirmier en pratique avancée (IPA)","Diplôme d'État de sage-femme",null,null,"Droit des affaires","Diplôme d'État de sage-femme",null,"Aix_Marseille_Université_AMU","Diplôme de formation approfondie en sciences pharmaceutiques (DFASP)","NOACCRR2C_04","DFA"]
["Comue_Bourgogne_Franche_Comté","0251985X",{"$f":"H14","v":12},null,"Diplôme d'État de sage-femme","Histoire","Administration économique et sociale","Economie de l'environnement, de l'énergie\net des transports ","Économie appliquée","Biobanques et gestion des données complexes",null,null,"Administration publique","Electronique, énergie électrique, automatique","Diplôme d'État de sage-femme","Management et administration des entreprises","Contrôle de gestion et audit organisationnel  ","Management et commerce international","Diplôme d'État de sage-femme","Actuariat ",null,null,"Droit notarial","Arts, lettres et civilisations",null,"Aix_Marseille_Université_AMU","Diplôme d’État d’infirmier en pratique avancée (IPA)","NOACCRR2C_05","Diplôme d'État"]
["Università_di_Corsica_Pasquale_Paoli","7200664J",{"$f":"I21","v":19},null,"Acoustique et musicologie","Informatique","Archéologie, sciences pour l'archéologie","Humanités numériques","Gestion de l'environnement","Biocontrôle pour la santé des plantes",null,null,"Arts de la scène et du spectacle vivant","Entrepreneuriat et management de\nprojets","Administration économique et sociale","Méthodes informatiques appliquées à la gestion des entreprises - MIAGE","Droit privé  ",{"$f":"COUNTA(Université_de_la_Polynésie_française_UPF)","v":5},"Analyse et politique économique","Administration économique et sociale",null,null,"Droit public","Biodiversité, écologie et évolution",null,"Aix_Marseille_Université_AMU","Diplôme d'État de sage-femme","NOACCRR2C_06","Diplôme d'État"]
["Université_Côte_d_Azur","0062126D",{"$f":"J60","v":58},null,"Administration et liquidation d'entreprises en difficulté","Innovation, entreprise et société","Biodiversité, écologie et évolution","Intelligence économique","Histoire","Gestion des risques environnementaux",null,null,"Chimie ","Histoire, civilisations, patrimoine  ","Agrosciences, environnement, territoires, paysage, forêt","Science de la durabilité - Sustainability Science","Droit public  ",null,"Arts de la scène et du spectacle vivant  ","Administration publique ",null,null,"Droit social","Biologie, agrosciences",null,"Aix_Marseille_Université_AMU","Acoustique et musicologie",20180580,"Master"]
["École_centrale_de_Marseille ","0133774G",{"$f":"K3","v":1},null,"Anthropologie","Langues et sociétés","Biologie-santé","Mathématiques physiques","Information, communication","Management de la filière arômes et parfums",null,null,"Comptabilité - contrôle - audit","Information, communication","Arts",{"$f":"COUNTA(Université_de_la_Nouvelle_Calédonie_UNC)","v":7},"Droit social  ",null,"Biologie, agrosciences","Analyse et politique économique ",null,null,"Economie du développement","Biologie-santé",null,"Aix_Marseille_Université_AMU","Administration et liquidation d'entreprises en difficulté",20180588,"Master"]
["EURECOM","0062022R",{"$f":"L4","v":2},null,"Archéologie, sciences pour l'archéologie","Management sectoriel","Chimie","Physique fondamentale et applications","Informatique","Modélisation des systèmes neuronaux et cognitifs",null,null,"Design","Innovation, entreprise et société  ","Audiovisuel, médias interactifs numériques, jeux",null,"Économétrie, statistiques  ",null,"Biologie-santé","Archéologie, sciences pour l'archéologie",null,null,"Finance","Chimie et sciences des matériaux",null,"Aix_Marseille_Université_AMU","Anthropologie",20180619,"Master"]
["Université_de_Franche_Comté_UFC_U_Besançon","0251215K",{"$f":"M46","v":44},null,"Arts","Sciences et technologie de l'agriculture, de l'alimentation et de l'environnement","Comptabilité • contrôle • audit","Sciences du médicament et des produits de santé","Ingénierie de la santé","Science, conservation & valorisation des ressources marines",null,null,"Droit de l'entreprise","Langues étrangères appliquées","Chimie",null,"Économie internationale",null,"Biomécanique","Arts de la scène et du spectacle vivant",null,null,"Information, communication","Contrôle de gestion et audit organisationnel ",null,"Aix_Marseille_Université_AMU","Archéologie, sciences pour l'archéologie",20180620,"Master"]
["Université_de_Haute_Alsace_UHA","0681166Y",{"$f":"N17","v":15},null,"Biodiversité, écologie et évolution","Sciences sociales","Contrôle de gestion et audit organisationnel","Sciences et technologie de l'agriculture, de l'alimentation et de l'environnement","Justice, procès et procédures","Sciences des données et intelligence artificielle",null,null,"Droit des affaires","Marketing, vente","Cinéma et audiovisuel",null,"Géographie, aménagement, environnement et développement  ",null,"Calcul haute performance, simulation","Arts plastiques ",null,null,"Informatique","Droit de la santé ",null,"Aix_Marseille_Université_AMU","Arts",20180581,"Master"]
["Université_de_Lorraine_UL","0542493S",{"$f":"O84","v":82},null,"Bio-géosciences","Théâtre","Direction de projets ou établissements culturels","Systèmes de calculs embarqués","Langues étrangères appliquées","Smart-Ed Tech, cocréativité et numérique pour l’innovation éducative",null,null,"Droit du numérique","Mécanique","Civilisations, cultures el sociétés",null,"Histoire  ",null,"Chimie et sciences du vivant","Biologie-santé ",null,null,"Ingénierie des systèmes complexes","Droit de l'entreprise",null,"Aix_Marseille_Université_AMU","Biodiversité, écologie et évolution",20180638,"Master"]
["Université_de_la_Nouvelle_Calédonie_UNC","9830445S",{"$f":"P9","v":7},null,"Bio-informatique","Traduction et interprétation","Droit des affaires",{"$f":"COUNTA(Comue_Bourgogne_Franche_Comté)","v":12},"Langues, littératures et civilisations étrangères et régionales","Sound design et musique à l'écran",null,null,"Economie de l'entreprise et des marchés","Méthodes informatiques appliquées à la\ngestion des entreprises - MIAGE","Comptabilité - contrôle - audit",null,"Informatique",null,"Comptabilité - contrôle - audit","Biotechnologies",null,null,"Justice, procès et procédures","Droit de l'environnement et de l'urbanisme",null,"Aix_Marseille_Université_AMU","Bio-géosciences",20180636,"Master"]
["Université_d_Orléans","0450855K",{"$f":"Q34","v":32},null,"Biologie intégrative et physiologie",13,"Droit notarial",null,"Lettres","Administration et liquidation d'entreprises en difficulté",null,null,"Energie","Risques et environnement","Contrôle de gestion et audit organisationnel",null,"Langues et sociétés  ",null,"Contrôle de gestion et audit organisationnel","Chimie",null,null,"Langues et sociétés","Droit du patrimoine",null,"Aix_Marseille_Université_AMU","Bio-informatique",20180637,"Master"]
["Université_de_la_Polynésie_française_UPF","9840349G",{"$f":"R7","v":5},null,"Biologie structurale, génomique",null,"Droit public",null,"Management","Arts",null,null,"Finance","Sciences et technologie de l'agriculture, de l'alimentation et de l'environnement","Design",null,"Langues étrangères appliquées  ",null,"Droit","Cinéma et audiovisuel ",null,null,"Lettres et Humanités","Droit européen ",null,"Aix_Marseille_Université_AMU","Biologie intégrative et physiologie",20180639,"Master"]
["Université_de_Reims_Champagne_Ardenne_URCA","0511296G",{"$f":"S54","v":52},null,"Biologie-santé",null,"Économie appliquée",null,"Management sectoriel","Chimie moléculaire",null,null,"Français langue étrangère",{"$f":"COUNTA(Université_de_Haute_Alsace_UHA)","v":15},"Droit civil",null,"Lettres",null,"Droit de l'entreprise","Civilisations, cultures et sociétés ",null,null,"Management","Droit international",null,"Aix_Marseille_Université_AMU","Biologie structurale, génomique",20180640,"Master"]
["Université_de_Strasbourg_Unistra","0673021V",{"$f":"T86","v":84},null,"Chimie",null,"Electronique, énergie électrique, automatique",null,"Risques et environnement","Civilisations, cultures et sociétés",null,null,"Génie mécanique",null,"Droit des affaires",null,"Management des systèmes d'information ",null,"Droit notarial","Comptabilité - contrôle - audit",null,null,"Management et administration des entreprises","Droit public",null,"Aix_Marseille_Université_AMU","Biologie-santé",20180641,"Master"]
["Université_de_technologie_de_Belfort_Montbéliard_UTBM","0900424X",1,null,"Cinéma et audiovisuel",null,"Finance",null,"Sciences de l'éducation","Comptabilité-contrôle-audit",null,null,"Géographie, aménagement, environnement et développement",null,"Droit fiscal",null,"Management et administration des entreprises  ",null,"Droit pénal et sciences criminelles","Démographie",null,null,"Marketing, vente","Economie de l'entreprise et des marchés",null,"Aix_Marseille_Université_AMU","Chimie",20180642,"Master"]
["Université_de_technologie_de_Troyes_UTT","0101060Y",{"$f":"V4","v":2},null,"Comptabilité - contrôle - audit",null,"Gestion des ressources humaines",null,"Sciences et technologie de l'agriculture, de l'alimentation et de l'environnement","Contrôle de gestion et audit organisationnel",null,null,"Géoressources, géorisques, géotechnique",null,"Droit notarial",null,"Marketing, vente  ",null,"Droit privé","Design ",null,null,"Mathématiques et applications ","Finance",null,"Aix_Marseille_Université_AMU","Cinéma et audiovisuel",20180582,"Master"]
{"$rows_left_out":625}