{"text_format":"1","workbook":"xlsx","n_sheets":6,"sheets":["Notice","1. Présentation","2. Données de caractérisation","3. Auto-positionnement","4. Données","Nomenclature"],"not_rendered":{"charts":0,"images":1,"macros":1,"external_links":0,"defined_names":22,"comments":0,"pivot_tables":0},"unopened":[],"bounds":{"document_bytes":16777216,"sheet_cells":100000,"rows_first":2000,"rows_last":500,"rows_between":2000,"halvings":0,"cell_chars":16384,"cell_head_chars":4096},"cells_cut":0,"cells_raw":0,"read":"whole","date_system":"1900"}

{"sheet":"Notice","index":0,"n_rows":40,"n_cols":3,"rows_kept":40,"cut":false,"hidden":false,"merged":[[0,2,3,12]]}
[null,null,"DÉPARTEMENT D’ÉVALUATION DES FORMATIONS"]
["DEF Culture","V1.01"]
[]
[]
[]
[null,"Note d'utilisation"]
[]
[null,"Pourquoi ces tableaux ?"]
[null,"Ces tableaux ont pour finalité la collecte de données en vue de l'évaluation des formations de la vague C."]
[null,"Ces données seront utilisées par les comités d'experts dans le processus d'évaluation. "]
[]
[null,"Comment le remplir ?"]
[null,"Le mode d'emploi est le suivant."]
[]
[null,"1. Activer le contenu à l'ouverture du fichier"]
[null,null,"À l'ouverture du fichier, il est indispensable d'accepter l'activation des macros (ou des contenus) lorsque le tableur vous y invite, sans quoi le fichier ne pourra pas fonctionner correctement."]
[]
[null,"2. Renseigner d'abord les informations de l'onglet Présentation"]
[null,null,"En premier lieu, choisissez votre établissement et la formation concernée."]
[null,null,"Indiquez ensuite le nombre de mentions de votre formation. Ceci génèrera les zones de saisie adaptées aux données déclinées pour chaque mentions dans l'ensemble des onglets repérées par un astérisque."]
[null,null,"Attention, une fois le nombre de mentions saisi, vous ne pourrez plus le modifier. En cas de doute, choisissez un nombre supérieur, nous acceptons les lignes vides lors du dépôt du fichier."]
[null,null,"Il ne faut pas intervenir sur le fichier pendant le processus de génération de lignes. Ce processus peut prendre quelques instants."]
[null,null,"Renseigner alors l'intitulé de chaque mentions en face des cellules \"Intitulé des mentions\"."]
[]
[null,"3. Renseigner ensuite les autres onglets."]
[null,null,"Vous pouvez les saisir dans l'ordre de votre choix."]
[null,null,"Aucune saisie n'est attendue dans les cellules grisées, toute donnée saisie sera ignorée."]
[]
[null,"Une vidéo vous montrant comment remplir ce fichier est disponible sur la chaîne Youtube du Hcéres (https://www.youtube.com/channel/UCeVUbvBdAa33ibJmHGwVNTw)"]
[]
{"$rows_left_out":11}
{"sheet":"1. Présentation","index":1,"n_rows":904,"n_cols":6,"rows_kept":904,"cut":false,"hidden":false,"merged":[[10,5,10,11],[15,5,15,11],[3,6,4,11],[5,1,5,2],[8,5,8,11],[0,1,3,4]]}
[null,"DÉPARTEMENT D’ÉVALUATION DES FORMATIONS"]
[]
[]
[]
[]
[null,"1. Présentation de la formation"]
[]
["Code Hcéres"]
["P1","CI1","Établissement",null,null,"Sélectionnez un établissement dans la liste déroulante."]
["P2","CI2","Code UAI",{"$f":"IF(ISERROR(VLOOKUP($D$9,Nomenclature!$A$2:$B$20,2,FALSE)),\"\",VLOOKUP($D$9,Nomenclature!$A$2:$B$20,2,FALSE))","v":""}]
["P3","CI4","Intitulé de la formation",null,null,"Sélectionnez l'intitulé de la formation dans la liste déroulante. \nCet intitulé correspond à la liste envoyée au Hcéres le 01/10/2021."]
["P4",null,"Numéro d'identification",{"$f":"IF(ISERROR(INDEX(Nomenclature!$Y$2:$Y$55,MATCH(1,(Nomenclature!$X$2:$X$55=$D$9)*(Nomenclature!$Z$2:$Z$55=$D$11),0))),\"\",(INDEX(Nomenclature!$Y$2:$Y$55,MATCH(1,(Nomenclature!$X$2:$X$55=$D$9)*(Nomenclature!$Z$2:$Z$55=$D$11),0))))","v":""}]
["P5",null,"Niveau de cursus",{"$f":"IF(ISERROR(INDEX(Nomenclature!$AA$2:$AA$55,MATCH(1,(Nomenclature!$X$2:$X$55=$D$9)*(Nomenclature!$Z$2:$Z$55=$D$11),0))),\"\",(INDEX(Nomenclature!$AA$2:$AA$55,MATCH(1,(Nomenclature!$X$2:$X$55=$D$9)*(Nomenclature!$Z$2:$Z$55=$D$11),0))))","v":""}]
["P6","s","Lieu(x) de formation (y compris formations délocalisées)"]
["P7","CI6","Responsable(s) de la formation"]
["P8","CI8","Nombre de mentions de la formation",null,null,"Indiquer le nombre de mentions. Celui-ci doit correspondre aux lignes ajoutées dans les données déclinées par mention. \nAttention : il ne sera pas possible d'ajouter ou de supprimer d'autres mentions par la suite, sans refaire la saisie."]
["P9",null,"Intitulé des mentions"]
[]
[]
[]
[null,null,"étab","formation_nom"]
[null,null,"La_Rochelle_U","Droit"]
[null,null,"La_Rochelle_U","Génie civil"]
[null,null,"La_Rochelle_U","Géographie et aménagement"]
[null,null,"La_Rochelle_U","Gestion"]
[null,null,"La_Rochelle_U","Histoire"]
[null,null,"La_Rochelle_U","Informatique"]
[null,null,"La_Rochelle_U","Langues étrangères appliquées"]
[null,null,"La_Rochelle_U","Lettres"]
[null,null,"La_Rochelle_U","Mathématiques"]
{"$rows_left_out":875}
{"sheet":"2. Données de caractérisation","index":2,"n_rows":24,"n_cols":9,"rows_kept":24,"cut":false,"hidden":false,"merged":[[9,1,9,2],[5,6,6,8],[2,6,4,6],[0,1,3,5],[7,1,7,2],[5,1,5,2]]}
[null,"DÉPARTEMENT D’ÉVALUATION DES FORMATIONS"]
[]
[]
[]
[]
[null,{"$f":"'1. Présentation'!D11","v":0}]
[]
[null,"2- Données de caractérisation de la formation"]
[]
[null,"Données de caractérisation",null,"Année 2018-2019","Année 2019-2020","Année 2020-2021","Commentaires (non obligatoire)"]
["IG1","DC 1","Nombre total d’inscrits administratifs dans la formation* (dans tout le cycle)",null,null,null,null,null,"IG1"]
[null,"DC 2","dont étudiants internationaux* (Cf. Définition dans le glossaire)"]
[null,"DC 3","dont étudiants ayant des besoins spécifiques* (Cf. Définition dans le glossaire)"]
["IG1","DC 4","Nombre total d’hommes inscrits dans la formation (inscrits administratifs dans tout le cycle)",null,null,null,null,null,"IG1"]
["IG1","DC 5","Nombre total de femmes inscrites dans la formation (inscrits administratifs dans tout le cycle)",null,null,null,null,null,"IG1"]
[null,"DC 6","Nombre total d’inscrits administratifs en 1ère année du cycle*"]
[null,"DC 7","Nombre total d’inscrits administratifs en 2e année du cycle*"]
[null,"DC 8","Nombre total d’inscrits en 3e année du cycle*"]
[null,"DC 9","Capacité d'accueil"]
[null,"DC 10","Nombre d'heures étudiant pour tout le cycle"]
[null,"DC 11","Nombre d'heures étudiant en 1ère année"]
[null,"DC 12","Nombre d'heures étudiant en 2e année"]
[null,"DC 13","Nombre d'heures étudiant en 3e année"]
[null,"DC 14","Nombre total d'enseignants intervenant dans la formation"]

{"sheet":"3. Auto-positionnement","index":3,"n_rows":56,"n_cols":10,"rows_kept":56,"cut":false,"hidden":false,"merged":[[30,2,30,6],[31,2,31,6],[32,2,32,6],[25,2,25,6],[26,2,26,6],[27,2,27,6],[28,2,28,6],[29,2,29,6],[20,2,20,6],[21,2,21,6],[22,2,22,6],[23,2,23,6],[24,2,24,6],[33,2,33,6],[34,2,34,6],[35,1,45,1],[35,2,35,6],[36,2,36,6],[37,2,37,6],[38,2,38,6],[39,2,39,6],[40,2,40,6],[41,2,41,6],[42,2,42,6],[43,2,43,6],[44,2,44,6],[45,2,45,6],[19,1,34,1],[19,2,19,6],[53,1,55,1],[53,2,53,6],[54,2,54,6],[55,2,55,6],[46,1,52,1],[46,2,46,6],[47,2,47,6],[48,2,48,6],[49,2,49,6],[50,2,50,6],[51,2,51,6],[52,2,52,6],[17,7,18,7],[3,8,4,11],[5,8,6,11],[17,2,18,6],[8,1,8,10],[10,1,13,1],[0,1,3,5],[5,1,5,2],[7,1,7,3]]}
[null,"DÉPARTEMENT D’ÉVALUATION DES FORMATIONS"]
[]
[]
[]
[]
[null,{"$f":"'1. Présentation'!D11","v":0}]
[]
[null,"3- Auto-positionnement de la formation"]
[null,"Pour chacun des critères d'autoévaluation ci-dessous, la formation positionne son degré d’avancement, sur une échelle de 1 à 5, définie ci-dessous :"]
[null,"Niveau atteint",1,2,3,4,5]
[null,"Définition du niveau","Absence de politique","Politique définie","Politique appliquée ","Politique appliquée ","Politique appliquée"]
[null,null,"Action(s) envisagée(s)","Action(s) en cours de mise place","Action(s) en place","Action(s) en place","Action(s) en place"]
[null,null,"Pas de résultats obtenus","Résultats insuffisants","Résultats encourageants","Résultats satisfaisants","Très bons résultats"]
[null,null,"Pas d'amélioration continue","Processus d'autoévaluation défini","Autoévaluation occasionnelle","Autoévaluation régulière","Processus d'amélioration continue mis en œuvre "]
[null,null,"Les actions mises en œuvre et les résultats obtenus peuvent concerner, selon les critères, l'activité des enseignants, des étudiants, des enseignements ou des dispositifs."]
[null,null,"Par amélioration continue, on entend que les résultats sont analysés et les mesures correctives sont décidées et mises en œuvre."]
[]
[null,null,"Référentiel Hcéres - formations 1er et 2e cycle",null,null,null,null,"Code de la donnée","Niveau atteint ","Analyse de l'auto-positionnement"]
[null,null,null,null,null,null,null,null,"1, 2, 3, 4 ou 5","Justification obligatoire : freins et leviers (500 caractères maximum)"]
[null,"Domaine 1 :\n La politique et la caractérisation de la formation","Référence 1 : La formation est en adéquation avec la stratégie de formation de l’établissement."]
[null,null,"C1. La formation s’inscrit dans les ambitions, les orientations pédagogiques et les priorités thématiques de l’établissement.",null,null,null,null,"R1-C1"]
[null,null,"C2. La formation est construite en cohérence et en complémentarité avec les autres formations du même cycle et en articulation avec celles des autres cycles avec lesquelles elle s’inscrit en continuum.",null,null,null,null,"R1-C2"]
[null,null,"C3. La formation s’assure de la réalité et de la valeur ajoutée de ses partenariats académiques locaux, régionaux et nationaux.",null,null,null,null,"R1-C3"]
[null,null,"C4. La formation identifie l’apport de la pluridisciplinarité et de l’interdisciplinarité dans sa finalité.",null,null,null,null,"R1-C4"]
[null,null,"C5. La formation intègre les enjeux du développement durable.",null,null,null,null,"R1-C5"]
[null,null,"Référence 2 : La formation est ouverte à l’international en cohérence avec les priorités définies par l’établissement."]
[null,null,"C1. La formation développe une offre spécifique à l'international en s’assurant de la réalité et de la valeur ajoutée de ses partenariats internationaux.",null,null,null,null,"R2-C1"]
[null,null,"C2. La formation inclut des mobilités entrantes et sortantes des étudiants et bénéficie d'un soutien, y compris financier, à cet effet. ",null,null,null,null,"R2-C2"]
[null,null,"Référence 3 : La formation bénéficie d’un adossement à la recherche."]
[null,null,"C1. La formation intègre une formation à et par la recherche adaptée à sa finalité.",null,null,null,null,"R3-C1"]
{"$rows_left_out":27}
{"sheet":"4. Données","index":4,"n_rows":76,"n_cols":8,"rows_kept":76,"cut":false,"hidden":false,"merged":[[8,3,9,3],[18,2,19,2],[25,2,26,2],[28,2,32,2],[41,2,44,2],[22,2,23,2],[3,1,3,2],[47,2,50,2],[5,1,5,2],[6,1,6,7],[73,1,75,1],[3,4,4,7],[34,2,35,2],[51,1,72,1],[53,2,57,2],[59,2,62,2],[64,2,72,2],[10,1,32,1],[33,1,50,1],[8,5,8,7],[8,2,9,2],[8,4,9,4]]}
[null,"DÉPARTEMENT D’ÉVALUATION DES FORMATIONS"]
[]
[]
[null,{"$f":"'1. Présentation'!D11","v":0}]
[]
[null,"4. Données"]
[null,"Pour chacun des critères d'autoévaluation ci-dessous, indiquer une valeur caractérisant la formation pour chacune des années de référence.\nSi la donnée est invariante dans la période de référence, indiquer la valeur correspondant à la colonne 2020-2021."]
[]
[null,null,"Critère du référentiel","Code de la donnée","Données quantitatives","Valeurs pour chaque année de la période de référence"]
[null,null,null,null,null,"Année 2018-2019","Année 2019-2020","Année 2020-2021"]
[null,"Domaine 1 :\n La politique et la caractérisation de la formation","Référence 1 : La formation est en adéquation avec la stratégie de formation de l’établissement."]
[null,null,"C1. La formation s’inscrit dans les ambitions, les orientations pédagogiques et les priorités thématiques de l’établissement."]
[null,null,"C2. La formation est construite en cohérence et en complémentarité avec les autres formations du même cycle et en articulation avec celles des autres cycles avec lesquelles elle s’inscrit en continuum."]
[null,null,"C3. La formation s’assure de la réalité et de la valeur ajoutée de ses partenariats académiques locaux, régionaux et nationaux."]
[null,null,"C4. La formation identifie l’apport de la pluridisciplinarité et de l’interdisciplinarité dans sa finalité."]
[null,null,"C5. La formation intègre les enjeux du développement durable."]
[null,null,"Référence 2 : La formation est ouverte à l’international en cohérence avec les priorités définies par l’établissement."]
[null,null,"C1. La formation développe une offre spécifique à l'international en s’assurant de la réalité et de la valeur ajoutée de ses partenariats internationaux."]
[null,null,"C2. La formation inclut des mobilités entrantes et sortantes des étudiants, et bénéficie d'un soutien y compris financier, à cet effet.","DQT 2-2a","Nombre d'étudiants ayant bénéficié d'une mobilité sortante"]
[null,null,null,"DQT 2-2b","Nombre d'étudiants ayant bénéficié d'une mobilité entrante"]
[null,null,"Référence 3 : La formation bénéficie d’un adossement à la recherche."]
[null,null,"C1. La formation intègre une formation à et par la recherche adaptée à sa finalité. ","DQT 3-1","Nombre d'heures de formation à et par la recherche"]
[null,null,"C2. Des enseignants-chercheurs et chercheurs des disciplines de la formation participent aux enseignements.","DQT 3-2a","Nombre d'enseignants-chercheurs intervenant dans la formation"]
[null,null,null,"DQT 3-2b","Nombre d'heures étudiant assurées par des enseignants-chercheurs dans la formation"]
[null,null,"Référence 4 : La formation entretient des relations avec le monde socio-économique et intègre des éléments de professionnalisation."]
[null,null,"C1. La formation prend en compte les besoins socio-économiques du territoire pour définir ses débouchés, sa finalité et ses contenus, en lien avec sa fiche RNCP, et elle associe les acteurs socio-économiques à cette démarche.","DQT 4-1a","Nombre de professionnels extérieurs intervenant dans la formation"]
[null,null,null,"DQT 4-1b","Nombre d'heures étudiant des enseignements fondamentaux de la formation assurés par des professionnels extérieurs à la formation"]
[null,null,"C2. La formation définit sa politique en matière d’alternance et de formation continue en lien avec le positionnement et la stratégie de l’établissement.","DQT 4-2a","Nombre de formations ouvertes à la formation continue"]
[null,null,"C3. La formation prépare à l’insertion professionnelle et à l’entrepreneuriat au cours du cursus et elle fait intervenir à cette fin des acteurs socio-économiques.","DQT 4-3a","Nombre de semaines de stage obligatoire dans le cursus"]
[null,null,null,"DQT 4-3b","Nombre d'ECTS accordés au(x) stage(s) dans le cursus"]
{"$rows_left_out":47}
{"sheet":"Nomenclature","index":5,"n_rows":55,"n_cols":27,"rows_kept":55,"cut":false,"hidden":true,"merged":[]}
["Établissements","Codes UAI",null,"École_Média_Art_du_Grand_Chalon","École_nationale_supérieure_d_architecture_de_Marseille_ENSA_Marseille","École_nationale_supérieure_d_architecture_de_Nancy_ENSA_Nancy","École_nationale_supérieure_d_architecture_de_Strasbourg_ENSA_Strasbourg","École_nationale_supérieure_d_art_Dijon","École_nationale_supérieure_d_art_et_de_design_de_Nancy","École_nationale_supérieure_de_la_photographie_Arles","École_supérieure_d_art_d_Aix_en_Provence","École_supérieure_d_art_d_Avignon","École_supérieure_d_art_de_Lorraine_Metz_Epinal","École_supérieure_d_art_et_de_design_d_Orléans","École_supérieure_d_art_et_de_design_de_Reims","École_supérieure_d_art_et_de_design_Toulon_Provence_Méditerranée","Haute_école_des_arts_du_Rhin_Strasbourg_Mulhouse","INSA_Centre_Val_de_Loire","INSA_Strasbourg","Institut_national_supérieur_d_enseignement_artistique_Marseille_Méditerranée","Institut_supérieur_des_beaux_arts_de_Besançon","Université_Côte_d_Azur",null,"Libellé établissement","Numéro d'accréditation de la mention","Intitulé indiqué dans l'arrêté d'accréditation","Type de formation indiqué dans l'arrêté d'accréditation"]
["École_Média_Art_du_Grand_Chalon","0711734Z",{"$f":"D3","v":1},"Art","Diplôme d'État d'architecte","Diplôme d'État d'architecte","Diplôme d'État d'architecte","Art-DNA","Art-DNA","Art","Art-DNA","Art-DNA","Art-DNA","Design-DNA","Art-DNA","Art-DNA","Art-DNA","Diplôme d'État de Paysagiste","Diplôme d’architecte conférant le grade de master","Art-DNA","Art-DNA","Villa Arson, option Art-DNA",null,"École_Média_Art_du_Grand_Chalon","CULTURE_001","Art","DNA"]
["École_nationale_supérieure_d_architecture_de_Marseille_ENSA_Marseille","0130236L",{"$f":"E4","v":2},1,"Diplôme d'études en architecture ","Diplôme d'études en architecture ","Diplôme d'études en architecture ","Design-DNA","Communication-DNA",1,"Art-DNSEP","Art-DNSEP","Communication-DNA","Design-DNSEP","Design-DNA","Design","Communication-DNA",1,1,"Design-DNA","Communication-DNA","Villa Arson, option Art-DNSEP",null,"École_nationale_supérieure_d_architecture_de_Marseille_ENSA_Marseille","CULTURE_012","Diplôme d'État d'architecte","DEA"]
["École_nationale_supérieure_d_architecture_de_Nancy_ENSA_Nancy","0540135D",{"$f":"F4","v":2},null,2,2,2,"Art-DNSEP","Design-DNA",null,2,2,"Design d'expression",2,"Art-DNSEP","Art-DNSEP","Design-DNA",null,null,"Art-DNSEP","Art-DNSEP",null,null,"École_nationale_supérieure_d_architecture_de_Marseille_ENSA_Marseille","CULTURE_013","Diplôme d'études en architecture ","DEEA"]
["École_nationale_supérieure_d_architecture_de_Strasbourg_ENSA_Strasbourg","0670186N",{"$f":"G4","v":2},null,null,null,null,"Design-DNSEP","Art-DNSEP",null,null,null,"Art-DNSEP",null,"Design-DNSEP",3,"Art-DNSEP",null,null,"Design-DNSEP","Communication-DNSEP",null,null,"École_nationale_supérieure_d_architecture_de_Nancy_ENSA_Nancy","CULTURE_014","Diplôme d'État d'architecte","DEA"]
["École_nationale_supérieure_d_art_Dijon","0210092L",{"$f":"H6","v":4},null,null,null,null,4,"Communication-DNSEP",null,null,null,"Communication-DNSEP",null,4,null,"Communication-DNSEP",null,null,4,4,null,null,"École_nationale_supérieure_d_architecture_de_Nancy_ENSA_Nancy","CULTURE_015","Diplôme d'études en architecture ","DEEA"]
["École_nationale_supérieure_d_art_et_de_design_de_Nancy","0540136E",{"$f":"I8","v":6},null,null,null,null,null,"Design-DNSEP",null,null,null,5,null,null,null,"Design-DNSEP",null,null,null,null,null,null,"École_nationale_supérieure_d_architecture_de_Strasbourg_ENSA_Strasbourg","CULTURE_016","Diplôme d'Etat d'architecte","DEA"]
["École_nationale_supérieure_de_la_photographie_Arles","0133231S",{"$f":"J3","v":1},null,null,null,null,null,6,null,null,null,null,null,null,null,6,null,null,null,null,null,null,"École_nationale_supérieure_d_architecture_de_Strasbourg_ENSA_Strasbourg","CULTURE_017","Diplôme d'études en architecture ","DEEA"]
["École_supérieure_d_art_d_Aix_en_Provence","0130232G",{"$f":"K4","v":2},null,null,null,null,null,null,null,null,null,null,null,null,null,null,null,null,null,null,null,null,"École_nationale_supérieure_d_art_Dijon","CULTURE_002","Art-DNA","DNA"]
["École_supérieure_d_art_d_Avignon","0840612J",{"$f":"L4","v":2},null,null,null,null,null,null,null,null,null,null,null,null,null,null,null,null,null,null,null,null,"École_nationale_supérieure_d_art_Dijon","CULTURE_003","Design-DNA","DNA"]
["École_supérieure_d_art_de_Lorraine_Metz_Epinal","0572347S",{"$f":"M7","v":5},null,null,null,null,null,null,null,null,null,null,null,null,null,null,null,null,null,null,null,null,"École_nationale_supérieure_d_art_Dijon","CULTURE_004","Art-DNSEP","DNSEP"]
["École_supérieure_d_art_et_de_design_d_Orléans","0450932U",{"$f":"N4","v":2},null,null,null,null,null,null,null,null,null,null,null,null,null,null,null,null,null,null,null,null,"École_nationale_supérieure_d_art_Dijon","CULTURE_005","Design-DNSEP","DNSEP"]
["École_supérieure_d_art_et_de_design_de_Reims","0510084P",{"$f":"O6","v":4},null,null,null,null,null,null,null,null,null,null,null,null,null,null,null,null,null,null,null,null,"École_nationale_supérieure_d_art_et_de_design_de_Nancy","CULTURE_006","Art-DNA","DNA"]
["École_supérieure_d_art_et_de_design_Toulon_Provence_Méditerranée","0830828Z",{"$f":"P5","v":3},null,null,null,null,null,null,null,null,null,null,null,null,null,null,null,null,null,null,null,null,"École_nationale_supérieure_d_art_et_de_design_de_Nancy","CULTURE_007","Communication-DNA","DNA"]
["Haute_école_des_arts_du_Rhin_Strasbourg_Mulhouse","0673048Z",{"$f":"Q8","v":6},null,null,null,null,null,null,null,null,null,null,null,null,null,null,null,null,null,null,null,null,"École_nationale_supérieure_d_art_et_de_design_de_Nancy","CULTURE_008","Design-DNA","DNA"]
["INSA_Centre_Val_de_Loire","0180974L",1,null,null,null,null,null,null,null,null,null,null,null,null,null,null,null,null,null,null,null,null,"École_nationale_supérieure_d_art_et_de_design_de_Nancy","CULTURE_009","Art-DNSEP","DNSEP"]
["INSA_Strasbourg","0670190T",1,null,null,null,null,null,null,null,null,null,null,null,null,null,null,null,null,null,null,null,null,"École_nationale_supérieure_d_art_et_de_design_de_Nancy","CULTURE_010","Communication-DNSEP","DNSEP"]
["Institut_national_supérieur_d_enseignement_artistique_Marseille_Méditerranée","0132557J",{"$f":"T6","v":4},null,null,null,null,null,null,null,null,null,null,null,null,null,null,null,null,null,null,null,null,"École_nationale_supérieure_d_art_et_de_design_de_Nancy","CULTURE_011","Design-DNSEP","DNSEP"]
["Institut_supérieur_des_beaux_arts_de_Besançon","0251272X",{"$f":"U6","v":4},null,null,null,null,null,null,null,null,null,null,null,null,null,null,null,null,null,null,null,null,"École_nationale_supérieure_de_la_photographie_Arles","CULTURE_018","Art","DNSEP"]
["Université_Côte_d_Azur","0062126D",2,null,null,null,null,null,null,null,null,null,null,null,null,null,null,null,null,null,null,null,null,"École_supérieure_d_art_d_Aix_en_Provence","CULTURE_021","Art-DNA","DNA"]
[null,null,{"$f":"SUM(C2:C19)","v":52},null,null,null,null,null,null,null,null,null,null,null,null,null,null,null,null,null,null,null,null,"École_supérieure_d_art_d_Aix_en_Provence","CULTURE_022","Art-DNSEP","DNSEP"]
[null,50,null,null,null,null,null,null,null,null,null,null,null,null,null,null,null,null,null,null,null,null,null,"École_supérieure_d_art_d_Avignon","CULTURE_019","Art-DNA","DNA"]
[null,null,null,null,null,null,null,null,null,null,null,null,null,null,null,null,null,null,null,null,null,null,null,"École_supérieure_d_art_d_Avignon","CULTURE_020","Art-DNSEP","DNSEP"]
[null,{"$f":"B22=C21","v":false},null,null,null,null,null,null,null,null,null,null,null,null,null,null,null,null,null,null,null,null,null,"École_supérieure_d_art_de_Lorraine_Metz_Epinal","CULTURE_023","Art-DNA","DNA"]
[null,null,null,null,null,null,null,null,null,null,null,null,null,null,null,null,null,null,null,null,null,null,null,"École_supérieure_d_art_de_Lorraine_Metz_Epinal","CULTURE_024","Communication-DNA","DNA"]
[null,null,null,null,null,null,null,null,null,null,null,null,null,null,null,null,null,null,null,null,null,null,null,"École_supérieure_d_art_de_Lorraine_Metz_Epinal","CULTURE_025","Design d'expression","DNA"]
[null,null,null,null,null,null,null,null,null,null,null,null,null,null,null,null,null,null,null,null,null,null,null,"École_supérieure_d_art_de_Lorraine_Metz_Epinal","CULTURE_026","Art-DNSEP","DNSEP"]
[null,null,null,null,null,null,null,null,null,null,null,null,null,null,null,null,null,null,null,null,null,null,null,"École_supérieure_d_art_de_Lorraine_Metz_Epinal","CULTURE_027","Communication-DNSEP","DNSEP"]
[null,null,null,null,null,null,null,null,null,null,null,null,null,null,null,null,null,null,null,null,null,null,null,"École_supérieure_d_art_et_de_design_d_Orléans","CULTURE_032","Design-DNA","DNA"]
[null,null,null,null,null,null,null,null,null,null,null,null,null,null,null,null,null,null,null,null,null,null,null,"École_supérieure_d_art_et_de_design_d_Orléans","CULTURE_033","Design-DNSEP","DNSEP"]
{"$rows_left_out":25}